BDBM50427155 CHEMBL2323770
SMILES: Cn1cc(cn1)-c1cnc2ccc3ccc(CS(=O)(=O)NCc4cccnn4)cc3c(=O)c2c1
InChI Key: InChIKey=BTFPRWCRPNKPFB-UHFFFAOYSA-N
Data: 1 IC50
Activity Spreadsheet -- Enzyme Inhibition Constant Data from BindingDB
Found 1 hit for monomerid = 50427155
Trg + Lig
Ki
nM
ΔG°
kcal/mole
IC50
nM
Kd
nM
EC50/IC50
nM
koff
s-1
kon
M-1s-1
pHTemp
°C
Hepatocyte growth factor receptor
(Homo sapiens (Human))
BDBM50427155
(CHEMBL2323770)
Show SMILES Cn1cc(cn1)-c1cnc2ccc3ccc(CS(=O)(=O)NCc4cccnn4)cc3c(=O)c2c1
Show InChI InChI=1S/C24H20N6O3S/c1-30-14-19(12-27-30)18-10-22-23(25-11-18)7-6-17-5-4-16(9-21(17)24(22)31)15-34(32,33)28-13-20-3-2-8-26-29-20/h2-12,14,28H,13,15H2,1H3
n/an/a 1n/an/an/an/an/an/a
Merck& Co., Inc.
Curated by ChEMBL
Assay Description
Inhibition of c-MET (unknown origin)-catalyzed N-biotinylated EQEDEPEGDYFEWLECONH2 phosphorylation by TR-FRET assay
J Med Chem 56: 2294-310 (2013)
Article DOI: 10.1021/jm301619u
BindingDB Entry DOI: 10.7270/Q21837VX