BDBM50427207 CROTONIC ACID::Crotonate
SMILES: C\C=C\C(O)=O
InChI Key: InChIKey=LDHQCZJRKDOVOX-NSCUHMNNSA-N
Data: 4 IC50
PDB links: 2 PDB IDs match this monomer.
Activity Spreadsheet -- Enzyme Inhibition Constant Data from BindingDB
Found 4 hits for monomerid = 50427207
Trg + Lig
Ki
nM
ΔG°
kcal/mole
IC50
nM
Kd
nM
EC50/IC50
nM
koff
s-1
kon
M-1s-1
pHTemp
°C
D-amino-acid oxidase
(Homo sapiens (Human))
BDBM50427207
(CROTONIC ACID | Crotonate)
Show SMILES C\C=C\C(O)=O
Show InChI InChI=1S/C4H6O2/c1-2-3-4(5)6/h2-3H,1H3,(H,5,6)/b3-2+
Reactome pathway
n/an/a 5.98E+5n/an/an/an/an/an/a
Kitasato University
Curated by ChEMBL
Assay Description
Inhibition of human recombinant N-terminal His-tagged DAO expressed in Escherichia coli BL21(DE3) using D-alanine as substrate by colorimetric assay
J Med Chem 56: 1894-907 (2013)
Article DOI: 10.1021/jm3017865
BindingDB Entry DOI: 10.7270/Q2H70H4P
D-Aspartate Oxidase (DDO)
(Homo sapiens (Human))
BDBM50427207
(CROTONIC ACID | Crotonate)
Show SMILES C\C=C\C(O)=O
Show InChI InChI=1S/C4H6O2/c1-2-3-4(5)6/h2-3H,1H3,(H,5,6)/b3-2+
n/an/a>1.00E+7n/an/an/an/an/an/a
Kitasato University
Curated by ChEMBL
Assay Description
Inhibition of human recombinant N-terminal His-tagged DDO expressed in Escherichia coli BL21(DE3) using D-aspartate as substrate by colorimetric assa...
J Med Chem 56: 1894-907 (2013)
Article DOI: 10.1021/jm3017865
BindingDB Entry DOI: 10.7270/Q2H70H4P
Serine racemase
(Homo sapiens (Human))
BDBM50427207
(CROTONIC ACID | Crotonate)
Show SMILES C\C=C\C(O)=O
Show InChI InChI=1S/C4H6O2/c1-2-3-4(5)6/h2-3H,1H3,(H,5,6)/b3-2+
n/an/a>1.00E+7n/an/an/an/an/an/a
Kitasato University
Curated by ChEMBL
Assay Description
Inhibition of human recombinant N-terminal His-tagged serine racemase expressed in Escherichia coli BL21(DE3) using L-serine as substrate after 10 mi...
J Med Chem 56: 1894-907 (2013)
Article DOI: 10.1021/jm3017865
BindingDB Entry DOI: 10.7270/Q2H70H4P
D-amino-acid oxidase
(Homo sapiens (Human))
BDBM50427207
(CROTONIC ACID | Crotonate)
Show SMILES C\C=C\C(O)=O
Show InChI InChI=1S/C4H6O2/c1-2-3-4(5)6/h2-3H,1H3,(H,5,6)/b3-2+
Reactome pathway
n/an/a 3.57E+5n/an/an/an/an/an/a
Kitasato University
Curated by ChEMBL
Assay Description
Inhibition of human recombinant N-terminal His-tagged DAO expressed in Escherichia coli BL21(DE3) using D-serine as substrate by colorimetric assay
J Med Chem 56: 1894-907 (2013)
Article DOI: 10.1021/jm3017865
BindingDB Entry DOI: 10.7270/Q2H70H4P