BDBM50427237 CHEMBL2325093
SMILES: Cc1ccc(cc1)C1=NN(C(C1)c1cccc2ccccc12)c1ccccc1
InChI Key: InChIKey=KURMNYSHIPGJRW-UHFFFAOYSA-N
Data: 2 IC50
Activity Spreadsheet -- Enzyme Inhibition Constant Data from BindingDB
Found 2 hits for monomerid = 50427237
Trg + Lig
Ki
nM
ΔG°
kcal/mole
IC50
nM
Kd
nM
EC50/IC50
nM
koff
s-1
kon
M-1s-1
pHTemp
°C
Epidermal growth factor receptor
(Homo sapiens (Human))
BDBM50427237
(CHEMBL2325093)
Show SMILES Cc1ccc(cc1)C1=NN(C(C1)c1cccc2ccccc12)c1ccccc1 |t:8|
Show InChI InChI=1S/C26H22N2/c1-19-14-16-21(17-15-19)25-18-26(28(27-25)22-10-3-2-4-11-22)24-13-7-9-20-8-5-6-12-23(20)24/h2-17,26H,18H2,1H3
n/an/a 200n/an/an/an/an/an/a
Nanjing University
Curated by ChEMBL
Assay Description
Inhibition of recombinant EGFR cytoplasmic domain (645 to 1186) (unknown origin) autophosphorylation after 1 hr
Bioorg Med Chem 21: 1050-63 (2013)
Article DOI: 10.1016/j.bmc.2013.01.013
BindingDB Entry DOI: 10.7270/Q27S7Q3D
Receptor tyrosine-protein kinase erbB-2
(Homo sapiens (Human))
BDBM50427237
(CHEMBL2325093)
Show SMILES Cc1ccc(cc1)C1=NN(C(C1)c1cccc2ccccc12)c1ccccc1 |t:8|
Show InChI InChI=1S/C26H22N2/c1-19-14-16-21(17-15-19)25-18-26(28(27-25)22-10-3-2-4-11-22)24-13-7-9-20-8-5-6-12-23(20)24/h2-17,26H,18H2,1H3
n/an/a 1.91E+3n/an/an/an/an/an/a
Nanjing University
Curated by ChEMBL
Assay Description
Inhibition of human recombinant HER-2 cytoplasmic domain (676 to 1245) autophosphorylation after 1 hr
Bioorg Med Chem 21: 1050-63 (2013)
Article DOI: 10.1016/j.bmc.2013.01.013
BindingDB Entry DOI: 10.7270/Q27S7Q3D