BDBM50427334 CHEMBL2325994::US10654855, Example 47::US9492453, 47
SMILES: NC1(CCN(CC1)c1ncnc2[nH]ccc12)C(=O)NC(CCCN1CCCC1)c1ccc(Cl)cc1
InChI Key: InChIKey=PUOMPMDYBUMBMJ-UHFFFAOYSA-N
Data: 7 IC50
Activity Spreadsheet -- Enzyme Inhibition Constant Data from BindingDB
Found 8 hits for monomerid = 50427334
Trg + Lig
Ki
nM
ΔG°
kcal/mole
IC50
nM
Kd
nM
EC50/IC50
nM
koff
s-1
kon
M-1s-1
pHTemp
°C
RAC-alpha serine/threonine-protein kinase
(Homo sapiens (Human))
BDBM50427334
(CHEMBL2325994 | US10654855, Example 47 | US1123609...)
Show SMILES NC1(CCN(CC1)c1ncnc2[nH]ccc12)C(=O)NC(CCCN1CCCC1)c1ccc(Cl)cc1
Show InChI InChI=1S/C26H34ClN7O/c27-20-7-5-19(6-8-20)22(4-3-15-33-13-1-2-14-33)32-25(35)26(28)10-16-34(17-11-26)24-21-9-12-29-23(21)30-18-31-24/h5-9,12,18,22H,1-4,10-11,13-17,28H2,(H,32,35)(H,29,30,31)
US Patent
n/an/a 3.60n/an/an/an/a7.525
AstraZeneca AB
US Patent
Assay Description
This assay detects inhibitors of AKT1 (PKBα) kinase activity using Caliper LabChip LC3000. The Caliper off-chip incubation mobility shift assay...
US Patent US9492453 (2016)
BindingDB Entry DOI: 10.7270/Q2KH0M83
RAC-beta serine/threonine-protein kinase
(Homo sapiens (Human))
BDBM50427334
(CHEMBL2325994 | US10654855, Example 47 | US1123609...)
Show SMILES NC1(CCN(CC1)c1ncnc2[nH]ccc12)C(=O)NC(CCCN1CCCC1)c1ccc(Cl)cc1
Show InChI InChI=1S/C26H34ClN7O/c27-20-7-5-19(6-8-20)22(4-3-15-33-13-1-2-14-33)32-25(35)26(28)10-16-34(17-11-26)24-21-9-12-29-23(21)30-18-31-24/h5-9,12,18,22H,1-4,10-11,13-17,28H2,(H,32,35)(H,29,30,31)
n/an/a 96n/an/an/an/an/an/a
AstraZeneca
Curated by ChEMBL
Assay Description
Inhibition of recombinant Akt2 (unknown origin) using 5-FAM-labeled peptide as substrate after 1 hr by caliper off-chip incubation mobility shift ass...
J Med Chem 56: 2059-73 (2013)
Article DOI: 10.1021/jm301762v
BindingDB Entry DOI: 10.7270/Q2QR4ZFN
RAC-alpha serine/threonine-protein kinase
(Homo sapiens (Human))
BDBM50427334
(CHEMBL2325994 | US10654855, Example 47 | US1123609...)
Show SMILES NC1(CCN(CC1)c1ncnc2[nH]ccc12)C(=O)NC(CCCN1CCCC1)c1ccc(Cl)cc1
Show InChI InChI=1S/C26H34ClN7O/c27-20-7-5-19(6-8-20)22(4-3-15-33-13-1-2-14-33)32-25(35)26(28)10-16-34(17-11-26)24-21-9-12-29-23(21)30-18-31-24/h5-9,12,18,22H,1-4,10-11,13-17,28H2,(H,32,35)(H,29,30,31)
n/an/a 4n/an/an/an/an/an/a
AstraZeneca
Curated by ChEMBL
Assay Description
Inhibition of recombinant Akt1 (unknown origin) using 5-FAM-labeled peptide as substrate after 1 hr by caliper off-chip incubation mobility shift ass...
J Med Chem 56: 2059-73 (2013)
Article DOI: 10.1021/jm301762v
BindingDB Entry DOI: 10.7270/Q2QR4ZFN
RAC-alpha serine/threonine-protein kinase
(Homo sapiens (Human))
BDBM50427334
(CHEMBL2325994 | US10654855, Example 47 | US1123609...)
Show SMILES NC1(CCN(CC1)c1ncnc2[nH]ccc12)C(=O)NC(CCCN1CCCC1)c1ccc(Cl)cc1
Show InChI InChI=1S/C26H34ClN7O/c27-20-7-5-19(6-8-20)22(4-3-15-33-13-1-2-14-33)32-25(35)26(28)10-16-34(17-11-26)24-21-9-12-29-23(21)30-18-31-24/h5-9,12,18,22H,1-4,10-11,13-17,28H2,(H,32,35)(H,29,30,31)
n/an/a 3.60n/an/an/an/an/an/a
TBA
Citation and Details
RAC-gamma serine/threonine-protein kinase
(Homo sapiens (Human))
BDBM50427334
(CHEMBL2325994 | US10654855, Example 47 | US1123609...)
Show SMILES NC1(CCN(CC1)c1ncnc2[nH]ccc12)C(=O)NC(CCCN1CCCC1)c1ccc(Cl)cc1
Show InChI InChI=1S/C26H34ClN7O/c27-20-7-5-19(6-8-20)22(4-3-15-33-13-1-2-14-33)32-25(35)26(28)10-16-34(17-11-26)24-21-9-12-29-23(21)30-18-31-24/h5-9,12,18,22H,1-4,10-11,13-17,28H2,(H,32,35)(H,29,30,31)
NCI pathway
Reactome pathway
n/an/a 36n/an/an/an/an/an/a
AstraZeneca
Curated by ChEMBL
Assay Description
Inhibition of recombinant Akt3 (unknown origin) using 5-FAM-labeled peptide as substrate after 1 hr by caliper off-chip incubation mobility shift ass...
J Med Chem 56: 2059-73 (2013)
Article DOI: 10.1021/jm301762v
BindingDB Entry DOI: 10.7270/Q2QR4ZFN
Potassium voltage-gated channel subfamily H member 2
(Homo sapiens (Human))
BDBM50427334
(CHEMBL2325994 | US10654855, Example 47 | US1123609...)
Show SMILES NC1(CCN(CC1)c1ncnc2[nH]ccc12)C(=O)NC(CCCN1CCCC1)c1ccc(Cl)cc1
Show InChI InChI=1S/C26H34ClN7O/c27-20-7-5-19(6-8-20)22(4-3-15-33-13-1-2-14-33)32-25(35)26(28)10-16-34(17-11-26)24-21-9-12-29-23(21)30-18-31-24/h5-9,12,18,22H,1-4,10-11,13-17,28H2,(H,32,35)(H,29,30,31)
Reactome pathway
n/an/a>1.00E+5n/an/an/an/an/an/a
AstraZeneca
Curated by ChEMBL
Assay Description
Inhibition of human ERG expressed in CHO cells by ionworks assay
J Med Chem 56: 2059-73 (2013)
Article DOI: 10.1021/jm301762v
BindingDB Entry DOI: 10.7270/Q2QR4ZFN
RAC-alpha serine/threonine-protein kinase
(Homo sapiens (Human))
BDBM50427334
(CHEMBL2325994 | US10654855, Example 47 | US1123609...)
Show SMILES NC1(CCN(CC1)c1ncnc2[nH]ccc12)C(=O)NC(CCCN1CCCC1)c1ccc(Cl)cc1
Show InChI InChI=1S/C26H34ClN7O/c27-20-7-5-19(6-8-20)22(4-3-15-33-13-1-2-14-33)32-25(35)26(28)10-16-34(17-11-26)24-21-9-12-29-23(21)30-18-31-24/h5-9,12,18,22H,1-4,10-11,13-17,28H2,(H,32,35)(H,29,30,31)
US Patent
n/an/a 3.60n/an/an/an/an/an/a
AstraZeneca AB
US Patent
Assay Description
For Echo dosing the solvent was 100% DMSO. A master plate was prepared with 40 ul of 10 mM stock from our Primary Liquid Store in quadrant 1 of a Lab...
US Patent US10654855 (2020)
Rho-associated protein kinase 2
(Homo sapiens (Human))
BDBM50427334
(CHEMBL2325994 | US10654855, Example 47 | US1123609...)
Show SMILES NC1(CCN(CC1)c1ncnc2[nH]ccc12)C(=O)NC(CCCN1CCCC1)c1ccc(Cl)cc1
Show InChI InChI=1S/C26H34ClN7O/c27-20-7-5-19(6-8-20)22(4-3-15-33-13-1-2-14-33)32-25(35)26(28)10-16-34(17-11-26)24-21-9-12-29-23(21)30-18-31-24/h5-9,12,18,22H,1-4,10-11,13-17,28H2,(H,32,35)(H,29,30,31)
n/an/a 104n/an/an/an/an/an/a
AstraZeneca
Curated by ChEMBL
Assay Description
Inhibition of recombinant ROCK2 (unknown origin) using 5-FAM-labeled peptide as substrate after 1 hr by caliper off-chip incubation mobility shift as...
J Med Chem 56: 2059-73 (2013)
Article DOI: 10.1021/jm301762v
BindingDB Entry DOI: 10.7270/Q2QR4ZFN