BDBM50427511 CHROME AZUROL S::Chrome Azurol
SMILES: CC1=C\C(C=C(C([O-])=O)C1=O)=C(\c1cc(C)c(O)c(c1)C([O-])=O)c1c(Cl)ccc(c1Cl)S([O-])(=O)=O
InChI Key: InChIKey=GNKCWVPIWVNYKN-SFQUDFHCSA-K
Data: 1 EC50
Activity Spreadsheet -- Enzyme Inhibition Constant Data from BindingDB
Found 1 hit for monomerid = 50427511
Trg + Lig
Ki
nM
ΔG°
kcal/mole
IC50
nM
Kd
nM
EC50/IC50
nM
koff
s-1
kon
M-1s-1
pHTemp
°C
Nuclear factor NF-kappa-B (NF-kB)
(Homo sapiens (Human))
BDBM50427511
(CHROME AZUROL S | Chrome Azurol)
Show SMILES CC1=C\C(C=C(C([O-])=O)C1=O)=C(\c1cc(C)c(O)c(c1)C([O-])=O)c1c(Cl)ccc(c1Cl)S([O-])(=O)=O |t:1,4|
Show InChI InChI=1S/C23H16Cl2O9S/c1-9-5-11(7-13(20(9)26)22(28)29)17(12-6-10(2)21(27)14(8-12)23(30)31)18-15(24)3-4-16(19(18)25)35(32,33)34/h3-8,26H,1-2H3,(H,28,29)(H,30,31)(H,32,33,34)/p-3/b17-12+
n/an/an/an/a 1.00E+5n/an/an/an/a
Universit£ degli Studi di Padova
Curated by ChEMBL
Assay Description
Inhibition of human NF-kappaB p50/DNA interaction using 32P-labeled oligonucleotides as substrate preincubated for 20 mins before substrate addition ...
J Med Chem 56: 1830-42 (2013)
Article DOI: 10.1021/jm3009647
BindingDB Entry DOI: 10.7270/Q2TH8P10