BDBM50427513 PYROCATECHOL VIOLET
SMILES: Oc1ccc(cc1O)C(=C1CC(=O)C(=O)C=C1)c1ccccc1S(O)(=O)=O
InChI Key: InChIKey=NMFYJACBTOGSKS-UHFFFAOYSA-N
Data: 1 EC50
Activity Spreadsheet -- Enzyme Inhibition Constant Data from BindingDB
Found 1 hit for monomerid = 50427513
Trg + Lig
Ki
nM
ΔG°
kcal/mole
IC50
nM
Kd
nM
EC50/IC50
nM
koff
s-1
kon
M-1s-1
pHTemp
°C
Nuclear factor NF-kappa-B (NF-kB)
(Homo sapiens (Human))
BDBM50427513
(PYROCATECHOL VIOLET)
Show SMILES Oc1ccc(cc1O)C(=C1CC(=O)C(=O)C=C1)c1ccccc1S(O)(=O)=O |w:9.17,c:16|
Show InChI InChI=1S/C19H14O7S/c20-14-7-5-11(9-16(14)22)19(12-6-8-15(21)17(23)10-12)13-3-1-2-4-18(13)27(24,25)26/h1-9,20,22H,10H2,(H,24,25,26)
n/an/an/an/a 5.00E+4n/an/an/an/a
Universit£ degli Studi di Padova
Curated by ChEMBL
Assay Description
Inhibition of human NF-kappaB p50/DNA interaction using 32P-labeled oligonucleotides as substrate preincubated for 20 mins before substrate addition ...
J Med Chem 56: 1830-42 (2013)
Article DOI: 10.1021/jm3009647
BindingDB Entry DOI: 10.7270/Q2TH8P10