BDBM50427526 CHEMBL2322256
SMILES: Cc1c(CC(=O)Nc2cccc(O)c2)c(=O)oc2c(C)c3oc4CCCCc4c3cc12
InChI Key: InChIKey=NUNTUTZSQXQPFK-UHFFFAOYSA-N
Data: 1 EC50
Activity Spreadsheet -- Enzyme Inhibition Constant Data from BindingDB
Found 1 hit for monomerid = 50427526
Trg + Lig
Ki
nM
ΔG°
kcal/mole
IC50
nM
Kd
nM
EC50/IC50
nM
koff
s-1
kon
M-1s-1
pHTemp
°C
Nuclear factor NF-kappa-B (NF-kB)
(Homo sapiens (Human))
BDBM50427526
(CHEMBL2322256)
Show SMILES Cc1c(CC(=O)Nc2cccc(O)c2)c(=O)oc2c(C)c3oc4CCCCc4c3cc12
Show InChI InChI=1S/C25H23NO5/c1-13-18-11-20-17-8-3-4-9-21(17)30-24(20)14(2)23(18)31-25(29)19(13)12-22(28)26-15-6-5-7-16(27)10-15/h5-7,10-11,27H,3-4,8-9,12H2,1-2H3,(H,26,28)
n/an/an/an/a 3.00E+6n/an/an/an/a
Universit£ degli Studi di Padova
Curated by ChEMBL
Assay Description
Inhibition of human NF-kappaB p50/DNA interaction using 32P-labeled oligonucleotides as substrate preincubated for 20 mins before substrate addition ...
J Med Chem 56: 1830-42 (2013)
Article DOI: 10.1021/jm3009647
BindingDB Entry DOI: 10.7270/Q2TH8P10