BDBM50427553 CHEMBL1338939
SMILES: NC(=O)Nc1cccc(c1)C(F)(F)F
InChI Key: InChIKey=FQEIBEOBXKJAMZ-UHFFFAOYSA-N
Data: 1 Kd
PDB links: 1 PDB ID matches this monomer.
Activity Spreadsheet -- Enzyme Inhibition Constant Data from BindingDB
Found 1 hit for monomerid = 50427553
Trg + Lig
Ki
nM
ΔG°
kcal/mole
IC50
nM
Kd
nM
EC50/IC50
nM
koff
s-1
kon
M-1s-1
pHTemp
°C
Steroid Delta-isomerase
(Pseudomonas putida)
BDBM50427553
(CHEMBL1338939)
Show SMILES NC(=O)Nc1cccc(c1)C(F)(F)F
Show InChI InChI=1S/C8H7F3N2O/c9-8(10,11)5-2-1-3-6(4-5)13-7(12)14/h1-4H,(H3,12,13,14)
n/an/an/a 4.60E+4n/an/an/an/an/a
The University of Tokyo
Curated by ChEMBL
Assay Description
Binding affinity to Pseudomonas putida KSI by isothermal titration calorimetry
J Med Chem 56: 2155-9 (2013)
Article DOI: 10.1021/jm301603n
BindingDB Entry DOI: 10.7270/Q2PR7X98