BDBM50427669 CHEMBL2323520
SMILES: COc1ccc2n(C(=O)c3ccc(Cl)cc3)c(CCC(=O)NS(=O)(=O)c3ccc(cc3)C(C)=O)c(C)c2c1
InChI Key: InChIKey=OLCTXVYNJADUML-UHFFFAOYSA-N
Data: 2 IC50
Activity Spreadsheet -- Enzyme Inhibition Constant Data from BindingDB
Found 2 hits for monomerid = 50427669
Trg + Lig
Ki
nM
ΔG°
kcal/mole
IC50
nM
Kd
nM
EC50/IC50
nM
koff
s-1
kon
M-1s-1
pHTemp
°C
Aldo-keto reductase family 1 member C2
(Homo sapiens (Human))
BDBM50427669
(CHEMBL2323520)
Show SMILES COc1ccc2n(C(=O)c3ccc(Cl)cc3)c(CCC(=O)NS(=O)(=O)c3ccc(cc3)C(C)=O)c(C)c2c1
Show InChI InChI=1S/C28H25ClN2O6S/c1-17-24-16-22(37-3)10-13-26(24)31(28(34)20-4-8-21(29)9-5-20)25(17)14-15-27(33)30-38(35,36)23-11-6-19(7-12-23)18(2)32/h4-13,16H,14-15H2,1-3H3,(H,30,33)
Reactome pathway
n/an/a 2.74E+4n/an/an/an/an/an/a
Vanderbilt University School of Medicine
Curated by ChEMBL
Assay Description
Inhibition of human recombinant AKR1C2-mediated NADP+-dependent oxidation of S-(+)-1,2,3,4-tetrahydro-1-naphthol
J Med Chem 56: 2429-46 (2013)
Article DOI: 10.1021/jm3017656
BindingDB Entry DOI: 10.7270/Q2X92CMG
Aldo-keto reductase family 1 member C3
(Homo sapiens (Human))
BDBM50427669
(CHEMBL2323520)
Show SMILES COc1ccc2n(C(=O)c3ccc(Cl)cc3)c(CCC(=O)NS(=O)(=O)c3ccc(cc3)C(C)=O)c(C)c2c1
Show InChI InChI=1S/C28H25ClN2O6S/c1-17-24-16-22(37-3)10-13-26(24)31(28(34)20-4-8-21(29)9-5-20)25(17)14-15-27(33)30-38(35,36)23-11-6-19(7-12-23)18(2)32/h4-13,16H,14-15H2,1-3H3,(H,30,33)
n/an/a 2.65E+3n/an/an/an/an/an/a
Vanderbilt University School of Medicine
Curated by ChEMBL
Assay Description
Inhibition of human recombinant AKR1C3-mediated NADP+-dependent oxidation of S-(+)-1,2,3,4-tetrahydro-1-naphthol
J Med Chem 56: 2429-46 (2013)
Article DOI: 10.1021/jm3017656
BindingDB Entry DOI: 10.7270/Q2X92CMG