BDBM50427752 CHEMBL2325168
SMILES: O=C(NCC1CCCCC1)Nc1ccc2nnsc2c1
InChI Key: InChIKey=IXDMDLUUUJFRQB-UHFFFAOYSA-N
Data: 1 IC50
Activity Spreadsheet -- Enzyme Inhibition Constant Data from BindingDB
Found 1 hit for monomerid = 50427752
Trg + Lig
Ki
nM
ΔG°
kcal/mole
IC50
nM
Kd
nM
EC50/IC50
nM
koff
s-1
kon
M-1s-1
pHTemp
°C
Protein arginine methyltransferase 3 (PRMT3)
(Homo sapiens (Human))
BDBM50427752
(CHEMBL2325168)
Show SMILES O=C(NCC1CCCCC1)Nc1ccc2nnsc2c1
Show InChI InChI=1S/C14H18N4OS/c19-14(15-9-10-4-2-1-3-5-10)16-11-6-7-12-13(8-11)20-18-17-12/h6-8,10H,1-5,9H2,(H2,15,16,19)
n/an/a>5.00E+4n/an/an/an/an/an/a
University of North Carolina at Chapel Hill
Curated by ChEMBL
Assay Description
Inhibition of PRMT3 (unknown origin) using histone H4 (1 to 24) as substrate after 1 hr by scintillation proximity assay in presence of [3H]-S-adenos...
J Med Chem 56: 2110-24 (2013)
Article DOI: 10.1021/jm3018332
BindingDB Entry DOI: 10.7270/Q2W95BHJ