BDBM50427755 CHEMBL2325165
SMILES: O=C(NCCN1CCOCC1)Nc1ccc2nnsc2c1
InChI Key: InChIKey=QJEGCMDTWMZGLV-UHFFFAOYSA-N
Data: 1 IC50
Activity Spreadsheet -- Enzyme Inhibition Constant Data from BindingDB
Found 1 hit for monomerid = 50427755
Trg + Lig
Ki
nM
ΔG°
kcal/mole
IC50
nM
Kd
nM
EC50/IC50
nM
koff
s-1
kon
M-1s-1
pHTemp
°C
Protein arginine methyltransferase 3 (PRMT3)
(Homo sapiens (Human))
BDBM50427755
(CHEMBL2325165)
Show SMILES O=C(NCCN1CCOCC1)Nc1ccc2nnsc2c1
Show InChI InChI=1S/C13H17N5O2S/c19-13(14-3-4-18-5-7-20-8-6-18)15-10-1-2-11-12(9-10)21-17-16-11/h1-2,9H,3-8H2,(H2,14,15,19)
n/an/a>1.00E+4n/an/an/an/an/an/a
University of North Carolina at Chapel Hill
Curated by ChEMBL
Assay Description
Inhibition of PRMT3 (unknown origin) using histone H4 (1 to 24) as substrate after 1 hr by scintillation proximity assay in presence of [3H]-S-adenos...
J Med Chem 56: 2110-24 (2013)
Article DOI: 10.1021/jm3018332
BindingDB Entry DOI: 10.7270/Q2W95BHJ