BDBM50427756 CHEMBL2325164
SMILES: O=C(NCCN1CCCCC1)Nc1ccc2nnsc2c1
InChI Key: InChIKey=IZQNCGATJUWOCN-UHFFFAOYSA-N
Data: 1 IC50
Activity Spreadsheet -- Enzyme Inhibition Constant Data from BindingDB
Found 1 hit for monomerid = 50427756
Trg + Lig
Ki
nM
ΔG°
kcal/mole
IC50
nM
Kd
nM
EC50/IC50
nM
koff
s-1
kon
M-1s-1
pHTemp
°C
Protein arginine N-methyltransferase 3
(Homo sapiens (Human))
BDBM50427756
(CHEMBL2325164)
Show SMILES O=C(NCCN1CCCCC1)Nc1ccc2nnsc2c1
Show InChI InChI=1S/C14H19N5OS/c20-14(15-6-9-19-7-2-1-3-8-19)16-11-4-5-12-13(10-11)21-18-17-12/h4-5,10H,1-3,6-9H2,(H2,15,16,20)
n/an/a 5.20E+3n/an/an/an/an/an/a
University of North Carolina at Chapel Hill
Curated by ChEMBL
Assay Description
Inhibition of PRMT3 (unknown origin) using histone H4 (1 to 24) as substrate after 1 hr by scintillation proximity assay in presence of [3H]-S-adenos...
J Med Chem 56: 2110-24 (2013)
Article DOI: 10.1021/jm3018332
BindingDB Entry DOI: 10.7270/Q2W95BHJ