BDBM50427763 CHEMBL2325446
SMILES: O=C(NCCC1CCCCC1)Nc1ccc2[nH]ncc2c1
InChI Key: InChIKey=KPYSXLBVAPSHEK-UHFFFAOYSA-N
Data: 1 IC50
Activity Spreadsheet -- Enzyme Inhibition Constant Data from BindingDB
Found 1 hit for monomerid = 50427763
Trg + Lig
Ki
nM
ΔG°
kcal/mole
IC50
nM
Kd
nM
EC50/IC50
nM
koff
s-1
kon
M-1s-1
pHTemp
°C
Protein arginine methyltransferase 3 (PRMT3)
(Homo sapiens (Human))
BDBM50427763
(CHEMBL2325446)
Show SMILES O=C(NCCC1CCCCC1)Nc1ccc2[nH]ncc2c1
Show InChI InChI=1S/C16H22N4O/c21-16(17-9-8-12-4-2-1-3-5-12)19-14-6-7-15-13(10-14)11-18-20-15/h6-7,10-12H,1-5,8-9H2,(H,18,20)(H2,17,19,21)
n/an/a>1.00E+5n/an/an/an/an/an/a
University of North Carolina at Chapel Hill
Curated by ChEMBL
Assay Description
Inhibition of PRMT3 (unknown origin) using histone H4 (1 to 24) as substrate after 1 hr by scintillation proximity assay in presence of [3H]-S-adenos...
J Med Chem 56: 2110-24 (2013)
Article DOI: 10.1021/jm3018332
BindingDB Entry DOI: 10.7270/Q2W95BHJ