BDBM50427777 CHEMBL2325178
SMILES: CS(=O)(=O)c1ccc(CNC(=O)Nc2ccc3nnsc3c2)cc1
InChI Key: InChIKey=YEZPZAFPCATEAS-UHFFFAOYSA-N
Data: 1 IC50
Activity Spreadsheet -- Enzyme Inhibition Constant Data from BindingDB
Found 1 hit for monomerid = 50427777
Trg + Lig
Ki
nM
ΔG°
kcal/mole
IC50
nM
Kd
nM
EC50/IC50
nM
koff
s-1
kon
M-1s-1
pHTemp
°C
Protein arginine methyltransferase 3 (PRMT3)
(Homo sapiens (Human))
BDBM50427777
(CHEMBL2325178)
Show SMILES CS(=O)(=O)c1ccc(CNC(=O)Nc2ccc3nnsc3c2)cc1
Show InChI InChI=1S/C15H14N4O3S2/c1-24(21,22)12-5-2-10(3-6-12)9-16-15(20)17-11-4-7-13-14(8-11)23-19-18-13/h2-8H,9H2,1H3,(H2,16,17,20)
n/an/a 850n/an/an/an/an/an/a
University of North Carolina at Chapel Hill
Curated by ChEMBL
Assay Description
Inhibition of PRMT3 (unknown origin) using histone H4 (1 to 24) as substrate after 1 hr by scintillation proximity assay in presence of [3H]-S-adenos...
J Med Chem 56: 2110-24 (2013)
Article DOI: 10.1021/jm3018332
BindingDB Entry DOI: 10.7270/Q2W95BHJ