BDBM50427790 CHEMBL2325195
SMILES: OC(CNC(=O)Nc1ccc2nnsc2c1)C1CCCCC1
InChI Key: InChIKey=FHGYXIVVHQVKKI-UHFFFAOYSA-N
Data: 1 IC50
Activity Spreadsheet -- Enzyme Inhibition Constant Data from BindingDB
Found 1 hit for monomerid = 50427790
Trg + Lig
Ki
nM
ΔG°
kcal/mole
IC50
nM
Kd
nM
EC50/IC50
nM
koff
s-1
kon
M-1s-1
pHTemp
°C
Protein arginine methyltransferase 3 (PRMT3)
(Homo sapiens (Human))
BDBM50427790
(CHEMBL2325195)
Show SMILES OC(CNC(=O)Nc1ccc2nnsc2c1)C1CCCCC1
Show InChI InChI=1S/C15H20N4O2S/c20-13(10-4-2-1-3-5-10)9-16-15(21)17-11-6-7-12-14(8-11)22-19-18-12/h6-8,10,13,20H,1-5,9H2,(H2,16,17,21)
n/an/a 490n/an/an/an/an/an/a
University of North Carolina at Chapel Hill
Curated by ChEMBL
Assay Description
Inhibition of PRMT3 (unknown origin) using histone H4 (1 to 24) as substrate after 1 hr by scintillation proximity assay in presence of [3H]-S-adenos...
J Med Chem 56: 2110-24 (2013)
Article DOI: 10.1021/jm3018332
BindingDB Entry DOI: 10.7270/Q2W95BHJ