BDBM50427795 CHEMBL2325190
SMILES: NC(CNC(=O)Nc1ccc2nnsc2c1)c1ccccc1
InChI Key: InChIKey=OKICSQNGXCYUJC-UHFFFAOYSA-N
Data: 1 IC50
Activity Spreadsheet -- Enzyme Inhibition Constant Data from BindingDB
Found 1 hit for monomerid = 50427795
Trg + Lig
Ki
nM
ΔG°
kcal/mole
IC50
nM
Kd
nM
EC50/IC50
nM
koff
s-1
kon
M-1s-1
pHTemp
°C
Protein arginine N-methyltransferase 3
(Homo sapiens (Human))
BDBM50427795
(CHEMBL2325190)
Show SMILES NC(CNC(=O)Nc1ccc2nnsc2c1)c1ccccc1
Show InChI InChI=1S/C15H15N5OS/c16-12(10-4-2-1-3-5-10)9-17-15(21)18-11-6-7-13-14(8-11)22-20-19-13/h1-8,12H,9,16H2,(H2,17,18,21)
n/an/a 5.90E+3n/an/an/an/an/an/a
University of North Carolina at Chapel Hill
Curated by ChEMBL
Assay Description
Inhibition of PRMT3 (unknown origin) using histone H4 (1 to 24) as substrate after 1 hr by scintillation proximity assay in presence of [3H]-S-adenos...
J Med Chem 56: 2110-24 (2013)
Article DOI: 10.1021/jm3018332
BindingDB Entry DOI: 10.7270/Q2W95BHJ