BDBM50427841 CHEMBL2326073
SMILES: C[C@]12CC[C@H]3[C@H]([C@@H]1CC[C@@H]2O)[C@H](CCCCC#Cc1ccc2ccccc2c1)Cc1cc(O)ccc31
InChI Key: InChIKey=OWWNFHKDBPGHSM-XSPJCTAZSA-N
Data: 2 IC50
Activity Spreadsheet -- Enzyme Inhibition Constant Data from BindingDB
Found 2 hits for monomerid = 50427841
Trg + Lig
Ki
nM
ΔG°
kcal/mole
IC50
nM
Kd
nM
EC50/IC50
nM
koff
s-1
kon
M-1s-1
pHTemp
°C
Estrogen-related receptor beta
(Homo sapiens (Human))
BDBM50427841
(CHEMBL2326073)
Show SMILES C[C@]12CC[C@H]3[C@H]([C@@H]1CC[C@@H]2O)[C@H](CCCCC#Cc1ccc2ccccc2c1)Cc1cc(O)ccc31 |r|
Show InChI InChI=1S/C34H38O2/c1-34-19-18-30-29-15-14-28(35)22-27(29)21-26(33(30)31(34)16-17-32(34)36)11-5-3-2-4-8-23-12-13-24-9-6-7-10-25(24)20-23/h6-7,9-10,12-15,20,22,26,30-33,35-36H,2-3,5,11,16-19,21H2,1H3/t26-,30-,31+,32+,33-,34+/m1/s1
Reactome pathway
n/an/a 121n/an/an/an/an/an/a
University of Kansas Medical Center
Curated by ChEMBL
Assay Description
Displacement of [3H]E2 from human recombinant ERbeta receptor after overnight incubation by liquid scintillation counting analysis
J Med Chem 56: 2779-90 (2013)
Article DOI: 10.1021/jm3013773
BindingDB Entry DOI: 10.7270/Q2CC121G
Estrogen-related receptor alpha
(Homo sapiens (Human))
BDBM50427841
(CHEMBL2326073)
Show SMILES C[C@]12CC[C@H]3[C@H]([C@@H]1CC[C@@H]2O)[C@H](CCCCC#Cc1ccc2ccccc2c1)Cc1cc(O)ccc31 |r|
Show InChI InChI=1S/C34H38O2/c1-34-19-18-30-29-15-14-28(35)22-27(29)21-26(33(30)31(34)16-17-32(34)36)11-5-3-2-4-8-23-12-13-24-9-6-7-10-25(24)20-23/h6-7,9-10,12-15,20,22,26,30-33,35-36H,2-3,5,11,16-19,21H2,1H3/t26-,30-,31+,32+,33-,34+/m1/s1
Reactome pathway
n/an/a 176n/an/an/an/an/an/a
University of Kansas Medical Center
Curated by ChEMBL
Assay Description
Displacement of [3H]E2 from human recombinant ERalpha receptor after overnight incubation by liquid scintillation counting analysis
J Med Chem 56: 2779-90 (2013)
Article DOI: 10.1021/jm3013773
BindingDB Entry DOI: 10.7270/Q2CC121G