BDBM50428068 CHEMBL2322655::Cinnabarinic acid
SMILES: Nc1c(C(O)=O)c2nc3c(cccc3oc2cc1=O)C(O)=O
InChI Key: InChIKey=FSBKJYLVDRVPTK-UHFFFAOYSA-N
Data: 1 KI  1 IC50
Activity Spreadsheet -- Enzyme Inhibition Constant Data from BindingDB
Found 2 hits for monomerid = 50428068
Trg + Lig
Ki
nM
ΔG°
kcal/mole
IC50
nM
Kd
nM
EC50/IC50
nM
koff
s-1
kon
M-1s-1
pHTemp
°C
Indoleamine 2,3-dioxygenase 1
(Homo sapiens (Human))
BDBM50428068
(CHEMBL2322655 | Cinnabarinic acid)
Show SMILES Nc1c(C(O)=O)c2nc3c(cccc3oc2cc1=O)C(O)=O
Show InChI InChI=1S/C14H8N2O6/c15-10-6(17)4-8-12(9(10)14(20)21)16-11-5(13(18)19)2-1-3-7(11)22-8/h1-4H,15H2,(H,18,19)(H,20,21)
Reactome pathway
326n/an/an/an/an/an/an/an/a
University of Nottingham
Curated by ChEMBL
Assay Description
Inhibition of human recombinant N-terminus 6X-histidine-tagged indoleamine 2,3-dioxygenase expressed in Escherichia coli assessed as inhibition of L-...
J Med Chem 56: 3310-7 (2013)
Article DOI: 10.1021/jm400049z
BindingDB Entry DOI: 10.7270/Q29C6ZRX
Indoleamine 2,3-dioxygenase 1
(Homo sapiens (Human))
BDBM50428068
(CHEMBL2322655 | Cinnabarinic acid)
Show SMILES Nc1c(C(O)=O)c2nc3c(cccc3oc2cc1=O)C(O)=O
Show InChI InChI=1S/C14H8N2O6/c15-10-6(17)4-8-12(9(10)14(20)21)16-11-5(13(18)19)2-1-3-7(11)22-8/h1-4H,15H2,(H,18,19)(H,20,21)
Reactome pathway
n/an/a 460n/an/an/an/an/an/a
University of Nottingham
Curated by ChEMBL
Assay Description
Inhibition of human recombinant N-terminus 6X-histidine-tagged indoleamine 2,3-dioxygenase expressed in Escherichia coli assessed as inhibition of L-...
J Med Chem 56: 3310-7 (2013)
Article DOI: 10.1021/jm400049z
BindingDB Entry DOI: 10.7270/Q29C6ZRX