BDBM50428123 CHEMBL2331680::GDC-0349
SMILES: CCNC(=O)Nc1ccc(cc1)-c1nc2CN(CCc2c(n1)N1CCOC[C@@H]1C)C1COC1
InChI Key: InChIKey=RGJOJUGRHPQXGF-INIZCTEOSA-N
Data: 1 KI  4 IC50
Activity Spreadsheet -- Enzyme Inhibition Constant Data from BindingDB
Found 5 hits for monomerid = 50428123
Trg + Lig
Ki
nM
ΔG°
kcal/mole
IC50
nM
Kd
nM
EC50/IC50
nM
koff
s-1
kon
M-1s-1
pHTemp
°C
Serine/threonine-protein kinase mTOR
(Homo sapiens (Human))
BDBM50428123
(CHEMBL2331680 | GDC-0349)
Show SMILES CCNC(=O)Nc1ccc(cc1)-c1nc2CN(CCc2c(n1)N1CCOC[C@@H]1C)C1COC1 |r|
Show InChI InChI=1S/C24H32N6O3/c1-3-25-24(31)26-18-6-4-17(5-7-18)22-27-21-12-29(19-14-33-15-19)9-8-20(21)23(28-22)30-10-11-32-13-16(30)2/h4-7,16,19H,3,8-15H2,1-2H3,(H2,25,26,31)/t16-/m0/s1
NCI pathway
Reactome pathway
3.80n/an/an/an/an/an/an/an/a
Genentech
Curated by ChEMBL
Assay Description
Inhibition of recombinant mTOR (1360 to 2549)+GBL (unknown origin) using GFP-4E-BP1 as substrate after 30 mins by FRET assay
ACS Med Chem Lett 4: 103-7 (2013)
Article DOI: 10.1021/ml3003132
BindingDB Entry DOI: 10.7270/Q28C9XK3
Potassium voltage-gated channel subfamily H member 2
(Homo sapiens (Human))
BDBM50428123
(CHEMBL2331680 | GDC-0349)
Show SMILES CCNC(=O)Nc1ccc(cc1)-c1nc2CN(CCc2c(n1)N1CCOC[C@@H]1C)C1COC1 |r|
Show InChI InChI=1S/C24H32N6O3/c1-3-25-24(31)26-18-6-4-17(5-7-18)22-27-21-12-29(19-14-33-15-19)9-8-20(21)23(28-22)30-10-11-32-13-16(30)2/h4-7,16,19H,3,8-15H2,1-2H3,(H2,25,26,31)/t16-/m0/s1
Reactome pathway
n/an/a>1.00E+5n/an/an/an/an/an/a
Genentech
Curated by ChEMBL
Assay Description
Inhibition of human ERG by patch clamp assay
ACS Med Chem Lett 4: 103-7 (2013)
Article DOI: 10.1021/ml3003132
BindingDB Entry DOI: 10.7270/Q28C9XK3
Phosphatidylinositol 4,5-bisphosphate 3-kinase catalytic subunit alpha isoform
(Homo sapiens (Human))
BDBM50428123
(CHEMBL2331680 | GDC-0349)
Show SMILES CCNC(=O)Nc1ccc(cc1)-c1nc2CN(CCc2c(n1)N1CCOC[C@@H]1C)C1COC1 |r|
Show InChI InChI=1S/C24H32N6O3/c1-3-25-24(31)26-18-6-4-17(5-7-18)22-27-21-12-29(19-14-33-15-19)9-8-20(21)23(28-22)30-10-11-32-13-16(30)2/h4-7,16,19H,3,8-15H2,1-2H3,(H2,25,26,31)/t16-/m0/s1
NCI pathway
Reactome pathway
n/an/a 4.20E+3n/an/an/an/an/an/a
Jiangsu Key Laboratory of Drug Design and Optimization, China Pharmaceutical University, Nanjing 21009, China.
Curated by ChEMBL
Assay Description
Inhibition of PI3Kalpha (unknown origin) using lipid substrate by Kinase-Glo plus luminescence kinase assay or and ADP-Glo Plus luminescence kinase a...
Bioorg Med Chem Lett 27: 3395-3398 (2017)
Article DOI: 10.1016/j.bmcl.2017.06.010
BindingDB Entry DOI: 10.7270/Q23R0WBC
Serine/threonine-protein kinase mTOR
(Homo sapiens (Human))
BDBM50428123
(CHEMBL2331680 | GDC-0349)
Show SMILES CCNC(=O)Nc1ccc(cc1)-c1nc2CN(CCc2c(n1)N1CCOC[C@@H]1C)C1COC1 |r|
Show InChI InChI=1S/C24H32N6O3/c1-3-25-24(31)26-18-6-4-17(5-7-18)22-27-21-12-29(19-14-33-15-19)9-8-20(21)23(28-22)30-10-11-32-13-16(30)2/h4-7,16,19H,3,8-15H2,1-2H3,(H2,25,26,31)/t16-/m0/s1
NCI pathway
Reactome pathway
n/an/a 39n/an/an/an/an/an/a
Jiangsu Key Laboratory of Drug Design and Optimization, China Pharmaceutical University, Nanjing 21009, China.
Curated by ChEMBL
Assay Description
Inhibition of mTOR (unknown origin) by Kinase-Glo plus luminescence kinase assay or and ADP-Glo Plus luminescence kinase assay
Bioorg Med Chem Lett 27: 3395-3398 (2017)
Article DOI: 10.1016/j.bmcl.2017.06.010
BindingDB Entry DOI: 10.7270/Q23R0WBC
Cytochrome P450 3A4
(Homo sapiens (Human))
BDBM50428123
(CHEMBL2331680 | GDC-0349)
Show SMILES CCNC(=O)Nc1ccc(cc1)-c1nc2CN(CCc2c(n1)N1CCOC[C@@H]1C)C1COC1 |r|
Show InChI InChI=1S/C24H32N6O3/c1-3-25-24(31)26-18-6-4-17(5-7-18)22-27-21-12-29(19-14-33-15-19)9-8-20(21)23(28-22)30-10-11-32-13-16(30)2/h4-7,16,19H,3,8-15H2,1-2H3,(H2,25,26,31)/t16-/m0/s1
Reactome pathway
n/an/a>1.00E+4n/an/an/an/an/an/a
Genentech
Curated by ChEMBL
Assay Description
Time-dependent inhibition of CYP3A4 in human liver microsome using midazolam as substrate by TDI shift assay
ACS Med Chem Lett 4: 103-7 (2013)
Article DOI: 10.1021/ml3003132
BindingDB Entry DOI: 10.7270/Q28C9XK3