BDBM50428125 CHEMBL2331677
SMILES: CCNC(=O)Nc1ccc(cc1)-c1nc2CN(CCc2c(n1)N1CCOC[C@@H]1C)c1nccn1C
InChI Key: InChIKey=BALVINFSPVZXGT-KRWDZBQOSA-N
Data: 1 KI  1 IC50
Activity Spreadsheet -- Enzyme Inhibition Constant Data from BindingDB
Found 2 hits for monomerid = 50428125
Trg + Lig
Ki
nM
ΔG°
kcal/mole
IC50
nM
Kd
nM
EC50/IC50
nM
koff
s-1
kon
M-1s-1
pHTemp
°C
Serine/threonine-protein kinase mTOR
(Homo sapiens (Human))
BDBM50428125
(CHEMBL2331677)
Show SMILES CCNC(=O)Nc1ccc(cc1)-c1nc2CN(CCc2c(n1)N1CCOC[C@@H]1C)c1nccn1C |r|
Show InChI InChI=1S/C25H32N8O2/c1-4-26-24(34)28-19-7-5-18(6-8-19)22-29-21-15-32(25-27-10-12-31(25)3)11-9-20(21)23(30-22)33-13-14-35-16-17(33)2/h5-8,10,12,17H,4,9,11,13-16H2,1-3H3,(H2,26,28,34)/t17-/m0/s1
NCI pathway
Reactome pathway
1.40n/an/an/an/an/an/an/an/a
Genentech
Curated by ChEMBL
Assay Description
Inhibition of recombinant mTOR (1360 to 2549)+GBL (unknown origin) using GFP-4E-BP1 as substrate after 30 mins by FRET assay
ACS Med Chem Lett 4: 103-7 (2013)
Article DOI: 10.1021/ml3003132
BindingDB Entry DOI: 10.7270/Q28C9XK3
Cytochrome P450 3A4
(Homo sapiens (Human))
BDBM50428125
(CHEMBL2331677)
Show SMILES CCNC(=O)Nc1ccc(cc1)-c1nc2CN(CCc2c(n1)N1CCOC[C@@H]1C)c1nccn1C |r|
Show InChI InChI=1S/C25H32N8O2/c1-4-26-24(34)28-19-7-5-18(6-8-19)22-29-21-15-32(25-27-10-12-31(25)3)11-9-20(21)23(30-22)33-13-14-35-16-17(33)2/h5-8,10,12,17H,4,9,11,13-16H2,1-3H3,(H2,26,28,34)/t17-/m0/s1
Reactome pathway
n/an/a>1.00E+4n/an/an/an/an/an/a
Genentech
Curated by ChEMBL
Assay Description
Time-dependent inhibition of CYP3A4 in human liver microsome using midazolam as substrate by TDI shift assay
ACS Med Chem Lett 4: 103-7 (2013)
Article DOI: 10.1021/ml3003132
BindingDB Entry DOI: 10.7270/Q28C9XK3