BDBM50428236 CHEMBL1457864
SMILES: COc1cccc(c1)C(=O)Nc1cc(ccc1N1CCN(C)CC1)[N+]([O-])=O
InChI Key: InChIKey=XUPWXLOPCYFDQV-UHFFFAOYSA-N
Data: 1 Kd
Activity Spreadsheet -- Enzyme Inhibition Constant Data from BindingDB
Found 1 hit for monomerid = 50428236
Trg + Lig
Ki
nM
ΔG°
kcal/mole
IC50
nM
Kd
nM
EC50/IC50
nM
koff
s-1
kon
M-1s-1
pHTemp
°C
WD repeat-containing protein 5 (WDR5)
(Homo sapiens (Human))
BDBM50428236
(CHEMBL1457864)
Show SMILES COc1cccc(c1)C(=O)Nc1cc(ccc1N1CCN(C)CC1)[N+]([O-])=O
Show InChI InChI=1S/C19H22N4O4/c1-21-8-10-22(11-9-21)18-7-6-15(23(25)26)13-17(18)20-19(24)14-4-3-5-16(12-14)27-2/h3-7,12-13H,8-11H2,1-2H3,(H,20,24)
n/an/an/a 1.40E+3n/an/an/an/an/a
EntreMed Inc.
Curated by ChEMBL
Assay Description
Displacement of N-terminal isothiocyanate-fluorescein-labeled H3(ARTKQTARKSTGGKA) peptide from human WDR5 expressed in Escherichia coli BL21(DE3) by ...
ACS Med Chem Lett 4: 353-7 (2013)
Article DOI: 10.1021/ml300467n
BindingDB Entry DOI: 10.7270/Q2C53N6F