BDBM50428240 CHEMBL2337447
SMILES: CN1CCN(CC1)c1ccc(cc1NC(=O)c1cccc(Cl)c1)[N+]([O-])=O
InChI Key: InChIKey=QQMREAFPDZRCQL-UHFFFAOYSA-N
Data: 1 Kd
Activity Spreadsheet -- Enzyme Inhibition Constant Data from BindingDB
Found 1 hit for monomerid = 50428240
Trg + Lig
Ki
nM
ΔG°
kcal/mole
IC50
nM
Kd
nM
EC50/IC50
nM
koff
s-1
kon
M-1s-1
pHTemp
°C
WD repeat-containing protein 5 (WDR5)
(Homo sapiens (Human))
BDBM50428240
(CHEMBL2337447)
Show SMILES CN1CCN(CC1)c1ccc(cc1NC(=O)c1cccc(Cl)c1)[N+]([O-])=O
Show InChI InChI=1S/C18H19ClN4O3/c1-21-7-9-22(10-8-21)17-6-5-15(23(25)26)12-16(17)20-18(24)13-3-2-4-14(19)11-13/h2-6,11-12H,7-10H2,1H3,(H,20,24)
n/an/an/a 1.80E+3n/an/an/an/an/a
EntreMed Inc.
Curated by ChEMBL
Assay Description
Displacement of N-terminal isothiocyanate-fluorescein-labeled H3(ARTKQTARKSTGGKA) peptide from human WDR5 expressed in Escherichia coli BL21(DE3) by ...
ACS Med Chem Lett 4: 353-7 (2013)
Article DOI: 10.1021/ml300467n
BindingDB Entry DOI: 10.7270/Q2C53N6F