BDBM50428243 CHEMBL2337444
SMILES: NC1CCN(CC1)c1ccc(cc1NC(=O)c1ccccc1Cl)[N+]([O-])=O
InChI Key: InChIKey=HEIWDGOGAQQRED-UHFFFAOYSA-N
Data: 1 Kd
Activity Spreadsheet -- Enzyme Inhibition Constant Data from BindingDB
Found 1 hit for monomerid = 50428243
Trg + Lig
Ki
nM
ΔG°
kcal/mole
IC50
nM
Kd
nM
EC50/IC50
nM
koff
s-1
kon
M-1s-1
pHTemp
°C
WD repeat-containing protein 5 (WDR5)
(Homo sapiens (Human))
BDBM50428243
(CHEMBL2337444)
Show SMILES NC1CCN(CC1)c1ccc(cc1NC(=O)c1ccccc1Cl)[N+]([O-])=O
Show InChI InChI=1S/C18H19ClN4O3/c19-15-4-2-1-3-14(15)18(24)21-16-11-13(23(25)26)5-6-17(16)22-9-7-12(20)8-10-22/h1-6,11-12H,7-10,20H2,(H,21,24)
n/an/an/a>2.00E+4n/an/an/an/an/a
EntreMed Inc.
Curated by ChEMBL
Assay Description
Displacement of N-terminal isothiocyanate-fluorescein-labeled H3(ARTKQTARKSTGGKA) peptide from human WDR5 expressed in Escherichia coli BL21(DE3) by ...
ACS Med Chem Lett 4: 353-7 (2013)
Article DOI: 10.1021/ml300467n
BindingDB Entry DOI: 10.7270/Q2C53N6F