BDBM50428246 CHEMBL2337441
SMILES: CN(C)C1CCN(CC1)c1ccc(cc1NC(=O)c1ccccc1Cl)[N+]([O-])=O
InChI Key: InChIKey=VKCPJTGJMTXVTH-UHFFFAOYSA-N
Data: 1 Kd
Activity Spreadsheet -- Enzyme Inhibition Constant Data from BindingDB
Found 1 hit for monomerid = 50428246
Trg + Lig
Ki
nM
ΔG°
kcal/mole
IC50
nM
Kd
nM
EC50/IC50
nM
koff
s-1
kon
M-1s-1
pHTemp
°C
WD repeat-containing protein 5 (WDR5)
(Homo sapiens (Human))
BDBM50428246
(CHEMBL2337441)
Show SMILES CN(C)C1CCN(CC1)c1ccc(cc1NC(=O)c1ccccc1Cl)[N+]([O-])=O
Show InChI InChI=1S/C20H23ClN4O3/c1-23(2)14-9-11-24(12-10-14)19-8-7-15(25(27)28)13-18(19)22-20(26)16-5-3-4-6-17(16)21/h3-8,13-14H,9-12H2,1-2H3,(H,22,26)
n/an/an/a>2.00E+4n/an/an/an/an/a
EntreMed Inc.
Curated by ChEMBL
Assay Description
Displacement of N-terminal isothiocyanate-fluorescein-labeled H3(ARTKQTARKSTGGKA) peptide from human WDR5 expressed in Escherichia coli BL21(DE3) by ...
ACS Med Chem Lett 4: 353-7 (2013)
Article DOI: 10.1021/ml300467n
BindingDB Entry DOI: 10.7270/Q2C53N6F