BDBM50428302 CHEMBL2338366
SMILES: CCCCCCCCCCCCCCn1cc[n+](CC(O)(P(O)(O)=O)P(O)([O-])=O)c1
InChI Key: InChIKey=KQYWUYVPRGLCOM-UHFFFAOYSA-N
Data: 2 IC50
Activity Spreadsheet -- Enzyme Inhibition Constant Data from BindingDB
Found 2 hits for monomerid = 50428302
Trg + Lig
Ki
nM
ΔG°
kcal/mole
IC50
nM
Kd
nM
EC50/IC50
nM
koff
s-1
kon
M-1s-1
pHTemp
°C
Farnesyl diphosphate synthase
(Homo sapiens (Human))
BDBM50428302
(CHEMBL2338366)
Show SMILES CCCCCCCCCCCCCCn1cc[n+](CC(O)(P(O)(O)=O)P(O)([O-])=O)c1
Show InChI InChI=1S/C19H38N2O7P2/c1-2-3-4-5-6-7-8-9-10-11-12-13-14-20-15-16-21(18-20)17-19(22,29(23,24)25)30(26,27)28/h15-16,18,22H,2-14,17H2,1H3,(H3-,23,24,25,26,27,28)
Reactome pathway
n/an/a 3.20E+3n/an/an/an/an/an/a
PrenylX Research Institute
Curated by ChEMBL
Assay Description
Binding affinity to human FPPS at 1 mM by X-ray crystallographic analysis
ACS Med Chem Lett 4: 423-427 (2013)
Article DOI: 10.1021/ml4000436
BindingDB Entry DOI: 10.7270/Q2KP83GB
Farnesyl diphosphate synthase
(Homo sapiens (Human))
BDBM50428302
(CHEMBL2338366)
Show SMILES CCCCCCCCCCCCCCn1cc[n+](CC(O)(P(O)(O)=O)P(O)([O-])=O)c1
Show InChI InChI=1S/C19H38N2O7P2/c1-2-3-4-5-6-7-8-9-10-11-12-13-14-20-15-16-21(18-20)17-19(22,29(23,24)25)30(26,27)28/h15-16,18,22H,2-14,17H2,1H3,(H3-,23,24,25,26,27,28)
Reactome pathway
n/an/a 4.20E+4n/an/an/an/an/an/a
PrenylX Research Institute
Curated by ChEMBL
Assay Description
Inhibition of His6-tagged human truncated FPPS (6-353) expressed in Escherichia coli BL21(DE3) cells using geranyl diphosphate and isopentenyl diphos...
ACS Med Chem Lett 4: 423-427 (2013)
Article DOI: 10.1021/ml4000436
BindingDB Entry DOI: 10.7270/Q2KP83GB