null
SMILES: OP(O)(=O)C(C[n+]1cc[nH]c1)P(O)([O-])=O
InChI Key: InChIKey=URBRKJQDZXITHV-UHFFFAOYSA-N
Activity Spreadsheet -- Enzyme Inhibition Constant Data from BindingDB
Found 2 hits for monomerid = 50428304
Trg + Lig
Ki
nM
ΔG°
kcal/mole
IC50
nM
Kd
nM
EC50/IC50
nM
koff
s-1
kon
M-1s-1
pHTemp
°C
Farnesyl pyrophosphate synthase
(Homo sapiens (Human))
BDBM50428304
(CHEMBL2338368)
Show SMILES OP(O)(=O)C(C[n+]1cc[nH]c1)P(O)([O-])=O
Show InChI InChI=1S/C5H10N2O6P2/c8-14(9,10)5(15(11,12)13)3-7-2-1-6-4-7/h1-2,4-5H,3H2,(H4,8,9,10,11,12,13)
Reactome pathway
n/an/a 160n/an/an/an/an/an/a
PrenylX Research Institute
Curated by ChEMBL
Assay Description
Binding affinity to human FPPS at 1 mM by X-ray crystallographic analysis
ACS Med Chem Lett 4: 423-427 (2013)
Article DOI: 10.1021/ml4000436
BindingDB Entry DOI: 10.7270/Q2KP83GB
Farnesyl pyrophosphate synthase
(Homo sapiens (Human))
BDBM50428304
(CHEMBL2338368)
Show SMILES OP(O)(=O)C(C[n+]1cc[nH]c1)P(O)([O-])=O
Show InChI InChI=1S/C5H10N2O6P2/c8-14(9,10)5(15(11,12)13)3-7-2-1-6-4-7/h1-2,4-5H,3H2,(H4,8,9,10,11,12,13)
Reactome pathway
n/an/a 140n/an/an/an/an/an/a
PrenylX Research Institute
Curated by ChEMBL
Assay Description
Inhibition of His6-tagged human truncated FPPS (6-353) expressed in Escherichia coli BL21(DE3) cells using geranyl diphosphate and isopentenyl diphos...
ACS Med Chem Lett 4: 423-427 (2013)
Article DOI: 10.1021/ml4000436
BindingDB Entry DOI: 10.7270/Q2KP83GB