BDBM50428716 CHEMBL2333128::US9884828, 2-41
SMILES: C[C@@H](Nc1c(nnc2cc(ccc12)-c1ccc(cc1)S(C)(=O)=O)C(N)=O)C1CC1
InChI Key: InChIKey=HAZVCDSGCISCHC-GFCCVEGCSA-N
Data: 4 IC50
Activity Spreadsheet -- Enzyme Inhibition Constant Data from BindingDB
Found 4 hits for monomerid = 50428716
Trg + Lig
Ki
nM
ΔG°
kcal/mole
IC50
nM
Kd
nM
EC50/IC50
nM
koff
s-1
kon
M-1s-1
pHTemp
°C
Leucine-rich repeat serine/threonine-protein kinase 2 (LRRK2)
(Homo sapiens (Human))
BDBM50428716
(CHEMBL2333128 | US9884828, 2-41)
Show SMILES C[C@@H](Nc1c(nnc2cc(ccc12)-c1ccc(cc1)S(C)(=O)=O)C(N)=O)C1CC1 |r|
Show InChI InChI=1S/C21H22N4O3S/c1-12(13-3-4-13)23-19-17-10-7-15(11-18(17)24-25-20(19)21(22)26)14-5-8-16(9-6-14)29(2,27)28/h5-13H,3-4H2,1-2H3,(H2,22,26)(H,23,24)/t12-/m1/s1
n/an/a 1n/an/an/an/an/an/a
Elan Pharmaceuticals
Curated by ChEMBL
Assay Description
Inhibition of wild type GST-tagged LRRK2 (970 to 2527 amino acid residues) (unknown origin) assessed as inhibition of biotinylated-LRRKtide phosphory...
Bioorg Med Chem Lett 23: 71-4 (2012)
Article DOI: 10.1016/j.bmcl.2012.11.021
BindingDB Entry DOI: 10.7270/Q2930VHH
Leucine-rich repeat serine/threonine-protein kinase 2 (LRRK2)
(Homo sapiens (Human))
BDBM50428716
(CHEMBL2333128 | US9884828, 2-41)
Show SMILES C[C@@H](Nc1c(nnc2cc(ccc12)-c1ccc(cc1)S(C)(=O)=O)C(N)=O)C1CC1 |r|
Show InChI InChI=1S/C21H22N4O3S/c1-12(13-3-4-13)23-19-17-10-7-15(11-18(17)24-25-20(19)21(22)26)14-5-8-16(9-6-14)29(2,27)28/h5-13H,3-4H2,1-2H3,(H2,22,26)(H,23,24)/t12-/m1/s1
US Patent
n/an/a<6n/an/an/an/a7.525
Imago Pharmaceuticals, Inc.
US Patent
Assay Description
Compounds as described herein (compounds of Formula I, e.g., compounds of the above Examples) are tested for their in vitro kinase activities using v...
US Patent US9884828 (2018)
BindingDB Entry DOI: 10.7270/Q2NG4SNW
Macrophage colony stimulating factor receptor
(Homo sapiens (Human))
BDBM50428716
(CHEMBL2333128 | US9884828, 2-41)
Show SMILES C[C@@H](Nc1c(nnc2cc(ccc12)-c1ccc(cc1)S(C)(=O)=O)C(N)=O)C1CC1 |r|
Show InChI InChI=1S/C21H22N4O3S/c1-12(13-3-4-13)23-19-17-10-7-15(11-18(17)24-25-20(19)21(22)26)14-5-8-16(9-6-14)29(2,27)28/h5-13H,3-4H2,1-2H3,(H2,22,26)(H,23,24)/t12-/m1/s1
n/an/a 17n/an/an/an/an/an/a
Elan Pharmaceuticals
Curated by ChEMBL
Assay Description
Inhibition of CSF1R (unknown origin) by TR-FRET assay in presence of ATP
Bioorg Med Chem Lett 23: 71-4 (2012)
Article DOI: 10.1016/j.bmcl.2012.11.021
BindingDB Entry DOI: 10.7270/Q2930VHH
Platelet-derived growth factor receptor alpha
(Homo sapiens (Human))
BDBM50428716
(CHEMBL2333128 | US9884828, 2-41)
Show SMILES C[C@@H](Nc1c(nnc2cc(ccc12)-c1ccc(cc1)S(C)(=O)=O)C(N)=O)C1CC1 |r|
Show InChI InChI=1S/C21H22N4O3S/c1-12(13-3-4-13)23-19-17-10-7-15(11-18(17)24-25-20(19)21(22)26)14-5-8-16(9-6-14)29(2,27)28/h5-13H,3-4H2,1-2H3,(H2,22,26)(H,23,24)/t12-/m1/s1
n/an/a 54n/an/an/an/an/an/a
Elan Pharmaceuticals
Curated by ChEMBL
Assay Description
Inhibition of PDGFRalpha (unknown origin) by TR-FRET assay in presence of ATP
Bioorg Med Chem Lett 23: 71-4 (2012)
Article DOI: 10.1016/j.bmcl.2012.11.021
BindingDB Entry DOI: 10.7270/Q2930VHH