null
SMILES: CN1CCC(COCc2cc(cc(n2)C2CC2)C(F)(F)F)(CC1)c1ccc(F)cc1
InChI Key: InChIKey=IATCLJLCYDIURR-UHFFFAOYSA-N
Activity Spreadsheet -- Enzyme Inhibition Constant Data from BindingDB
Found 3 hits for monomerid = 50428760
Trg + Lig
Ki
nM
ΔG°
kcal/mole
IC50
nM
Kd
nM
EC50/IC50
nM
koff
s-1
kon
M-1s-1
pHTemp
°C
Potassium voltage-gated channel subfamily H member 2
(Homo sapiens (Human))
BDBM50428760
(BMS-817693 | CHEMBL2333637)
Show SMILES CN1CCC(COCc2cc(cc(n2)C2CC2)C(F)(F)F)(CC1)c1ccc(F)cc1
Show InChI InChI=1S/C23H26F4N2O/c1-29-10-8-22(9-11-29,17-4-6-19(24)7-5-17)15-30-14-20-12-18(23(25,26)27)13-21(28-20)16-2-3-16/h4-7,12-13,16H,2-3,8-11,14-15H2,1H3
Reactome pathway
n/an/a 1.30E+4n/an/an/an/an/an/a
Bristol-Myers Squibb Research and Development
Curated by ChEMBL
Assay Description
Inhibition of human ERG
Bioorg Med Chem Lett 23: 407-11 (2012)
Article DOI: 10.1016/j.bmcl.2012.11.094
BindingDB Entry DOI: 10.7270/Q2S46TBT
Sodium-dependent serotonin transporter
(Homo sapiens (Human))
BDBM50428760
(BMS-817693 | CHEMBL2333637)
Show SMILES CN1CCC(COCc2cc(cc(n2)C2CC2)C(F)(F)F)(CC1)c1ccc(F)cc1
Show InChI InChI=1S/C23H26F4N2O/c1-29-10-8-22(9-11-29,17-4-6-19(24)7-5-17)15-30-14-20-12-18(23(25,26)27)13-21(28-20)16-2-3-16/h4-7,12-13,16H,2-3,8-11,14-15H2,1H3
n/an/a 2.10n/an/an/an/an/an/a
Bristol-Myers Squibb Research and Development
Curated by ChEMBL
Assay Description
Displacement of [125I]RTI-55 from human SERT expressed in HEK293 cell membranes after 1 hr by scintillation counting analysis
Bioorg Med Chem Lett 23: 407-11 (2012)
Article DOI: 10.1016/j.bmcl.2012.11.094
BindingDB Entry DOI: 10.7270/Q2S46TBT
Substance-P receptor
(Homo sapiens (Human))
BDBM50428760
(BMS-817693 | CHEMBL2333637)
Show SMILES CN1CCC(COCc2cc(cc(n2)C2CC2)C(F)(F)F)(CC1)c1ccc(F)cc1
Show InChI InChI=1S/C23H26F4N2O/c1-29-10-8-22(9-11-29,17-4-6-19(24)7-5-17)15-30-14-20-12-18(23(25,26)27)13-21(28-20)16-2-3-16/h4-7,12-13,16H,2-3,8-11,14-15H2,1H3
Reactome pathway
n/an/a 1.90n/an/an/an/an/an/a
Bristol-Myers Squibb Research and Development
Curated by ChEMBL
Assay Description
Displacement of [125I] Substance P from human NK1 receptor expressed in human U373 cell membranes after 1 hr by scintillation counting analysis
Bioorg Med Chem Lett 23: 407-11 (2012)
Article DOI: 10.1016/j.bmcl.2012.11.094
BindingDB Entry DOI: 10.7270/Q2S46TBT