null
SMILES: CN1CCC(COCc2cc(cc(n2)N2CCC(C2)C#N)C(F)(F)F)(CC1)c1ccc(F)cc1
InChI Key: InChIKey=BEZICALLUMKYOA-UHFFFAOYSA-N
Activity Spreadsheet -- Enzyme Inhibition Constant Data from BindingDB
Found 3 hits for monomerid = 50428770
Trg + Lig
Ki
nM
ΔG°
kcal/mole
IC50
nM
Kd
nM
EC50/IC50
nM
koff
s-1
kon
M-1s-1
pHTemp
°C
Potassium voltage-gated channel subfamily H member 2
(Homo sapiens (Human))
BDBM50428770
(CHEMBL2333627)
Show SMILES CN1CCC(COCc2cc(cc(n2)N2CCC(C2)C#N)C(F)(F)F)(CC1)c1ccc(F)cc1
Show InChI InChI=1S/C25H28F4N4O/c1-32-10-7-24(8-11-32,19-2-4-21(26)5-3-19)17-34-16-22-12-20(25(27,28)29)13-23(31-22)33-9-6-18(14-30)15-33/h2-5,12-13,18H,6-11,15-17H2,1H3
Reactome pathway
n/an/a 8.30E+3n/an/an/an/an/an/a
Bristol-Myers Squibb Research and Development
Curated by ChEMBL
Assay Description
Inhibition of human ERG
Bioorg Med Chem Lett 23: 407-11 (2012)
Article DOI: 10.1016/j.bmcl.2012.11.094
BindingDB Entry DOI: 10.7270/Q2S46TBT
Sodium-dependent serotonin transporter
(Homo sapiens (Human))
BDBM50428770
(CHEMBL2333627)
Show SMILES CN1CCC(COCc2cc(cc(n2)N2CCC(C2)C#N)C(F)(F)F)(CC1)c1ccc(F)cc1
Show InChI InChI=1S/C25H28F4N4O/c1-32-10-7-24(8-11-32,19-2-4-21(26)5-3-19)17-34-16-22-12-20(25(27,28)29)13-23(31-22)33-9-6-18(14-30)15-33/h2-5,12-13,18H,6-11,15-17H2,1H3
n/an/a 3.30n/an/an/an/an/an/a
Bristol-Myers Squibb Research and Development
Curated by ChEMBL
Assay Description
Displacement of [125I]RTI-55 from human SERT expressed in HEK293 cell membranes after 1 hr by scintillation counting analysis
Bioorg Med Chem Lett 23: 407-11 (2012)
Article DOI: 10.1016/j.bmcl.2012.11.094
BindingDB Entry DOI: 10.7270/Q2S46TBT
Substance-P receptor
(Homo sapiens (Human))
BDBM50428770
(CHEMBL2333627)
Show SMILES CN1CCC(COCc2cc(cc(n2)N2CCC(C2)C#N)C(F)(F)F)(CC1)c1ccc(F)cc1
Show InChI InChI=1S/C25H28F4N4O/c1-32-10-7-24(8-11-32,19-2-4-21(26)5-3-19)17-34-16-22-12-20(25(27,28)29)13-23(31-22)33-9-6-18(14-30)15-33/h2-5,12-13,18H,6-11,15-17H2,1H3
Reactome pathway
n/an/a 29n/an/an/an/an/an/a
Bristol-Myers Squibb Research and Development
Curated by ChEMBL
Assay Description
Displacement of [125I] Substance P from human NK1 receptor expressed in human U373 cell membranes after 1 hr by scintillation counting analysis
Bioorg Med Chem Lett 23: 407-11 (2012)
Article DOI: 10.1016/j.bmcl.2012.11.094
BindingDB Entry DOI: 10.7270/Q2S46TBT