BDBM50428888 CHEMBL2331780
SMILES: CCNC(=O)c1cc(NS(=O)(=O)c2ccc(cc2)S(C)(=O)=O)ccc1Oc1cncc(Cl)c1
InChI Key: InChIKey=RONQKTMVQHLWFD-UHFFFAOYSA-N
Data: 1 IC50  1 EC50
Activity Spreadsheet -- Enzyme Inhibition Constant Data from BindingDB
Found 2 hits for monomerid = 50428888
Trg + Lig
Ki
nM
ΔG°
kcal/mole
IC50
nM
Kd
nM
EC50/IC50
nM
koff
s-1
kon
M-1s-1
pHTemp
°C
Peroxisome proliferator-activated receptor
(Homo sapiens (Human))
BDBM50428888
(CHEMBL2331780)
Show SMILES CCNC(=O)c1cc(NS(=O)(=O)c2ccc(cc2)S(C)(=O)=O)ccc1Oc1cncc(Cl)c1
Show InChI InChI=1S/C21H20ClN3O6S2/c1-3-24-21(26)19-11-15(4-9-20(19)31-16-10-14(22)12-23-13-16)25-33(29,30)18-7-5-17(6-8-18)32(2,27)28/h4-13,25H,3H2,1-2H3,(H,24,26)
NCI pathway
Reactome pathway
n/an/a>1.00E+4n/an/an/an/an/an/a
Amgen, Inc.
Curated by ChEMBL
Assay Description
Displacement of [3H]-rosiglitazone from GST-tagged PPARgammaLBD (unknown origin) after 1 hr by scintillation proximity assay
Bioorg Med Chem 21: 979-92 (2013)
Article DOI: 10.1016/j.bmc.2012.11.058
BindingDB Entry DOI: 10.7270/Q23F4R13
Peroxisome proliferator-activated receptor
(Homo sapiens (Human))
BDBM50428888
(CHEMBL2331780)
Show SMILES CCNC(=O)c1cc(NS(=O)(=O)c2ccc(cc2)S(C)(=O)=O)ccc1Oc1cncc(Cl)c1
Show InChI InChI=1S/C21H20ClN3O6S2/c1-3-24-21(26)19-11-15(4-9-20(19)31-16-10-14(22)12-23-13-16)25-33(29,30)18-7-5-17(6-8-18)32(2,27)28/h4-13,25H,3H2,1-2H3,(H,24,26)
NCI pathway
Reactome pathway
n/an/an/an/a>3.00E+4n/an/an/an/a
Amgen, Inc.
Curated by ChEMBL
Assay Description
Transactivation of GAL4 DBD-fused human PPARgamma-LBD expressed in HEK293 cells after 24 hrs by luciferase reporter gene assay
Bioorg Med Chem 21: 979-92 (2013)
Article DOI: 10.1016/j.bmc.2012.11.058
BindingDB Entry DOI: 10.7270/Q23F4R13