BDBM50428912 Betulinan C::CHEMBL2331809
SMILES: COC1=C(C(=O)C=C(C1=O)c1ccccc1)c1ccccc1
InChI Key: InChIKey=RPHQALSHGDIMKF-UHFFFAOYSA-N
Data: 1 IC50
Activity Spreadsheet -- Enzyme Inhibition Constant Data from BindingDB
Found 1 hit for monomerid = 50428912
Trg + Lig
Ki
nM
ΔG°
kcal/mole
IC50
nM
Kd
nM
EC50/IC50
nM
koff
s-1
kon
M-1s-1
pHTemp
°C
cAMP-specific 3',5'-cyclic phosphodiesterase 4B
(Homo sapiens (Human))
BDBM50428912
(Betulinan C | CHEMBL2331809)
Show SMILES COC1=C(C(=O)C=C(C1=O)c1ccccc1)c1ccccc1 |c:6,t:2|
Show InChI InChI=1S/C19H14O3/c1-22-19-17(14-10-6-3-7-11-14)16(20)12-15(18(19)21)13-8-4-2-5-9-13/h2-12H,1H3
n/an/a 1.70E+4n/an/an/an/an/an/a
University of North Carolina at Greensboro
Curated by ChEMBL
Assay Description
Inhibition of human PDE4B2
J Nat Prod 76: 382-7 (2013)
Article DOI: 10.1021/np300749w
BindingDB Entry DOI: 10.7270/Q2TX3GQQ