BDBM50429458 CHEMBL2332354::Catalposide
SMILES: OC[C@H]1O[C@@H](O[C@@H]2OC=C[C@H]3[C@H](OC(=O)c4ccc(O)cc4)[C@@H]4O[C@]4(CO)[C@@H]23)[C@H](O)[C@@H](O)[C@@H]1O
InChI Key: InChIKey=UXSACQOOWZMGSE-RWORTQBESA-N
Data: 1 Kd
Activity Spreadsheet -- Enzyme Inhibition Constant Data from BindingDB
Found 1 hit for monomerid = 50429458
Trg + Lig
Ki
nM
ΔG°
kcal/mole
IC50
nM
Kd
nM
EC50/IC50
nM
koff
s-1
kon
M-1s-1
pHTemp
°C
Heat shock protein HSP 90-alpha
(Homo sapiens (Human))
BDBM50429458
(CHEMBL2332354 | Catalposide)
Show SMILES OC[C@H]1O[C@@H](O[C@@H]2OC=C[C@H]3[C@H](OC(=O)c4ccc(O)cc4)[C@@H]4O[C@]4(CO)[C@@H]23)[C@H](O)[C@@H](O)[C@@H]1O |r,c:8|
Show InChI InChI=1S/C22H26O12/c23-7-12-14(26)15(27)16(28)21(31-12)33-20-13-11(5-6-30-20)17(18-22(13,8-24)34-18)32-19(29)9-1-3-10(25)4-2-9/h1-6,11-18,20-21,23-28H,7-8H2/t11-,12-,13-,14-,15+,16-,17+,18+,20+,21+,22-/m1/s1
NCI pathway
Reactome pathway
n/an/an/a 12n/an/an/an/an/a
Universit£ di Salerno
Curated by ChEMBL
Assay Description
Binding affinity to recombinant Hsp90 alpha (unknown origin) by surface plasmon resonance
J Med Chem 56: 1583-95 (2013)
Article DOI: 10.1021/jm301398y
BindingDB Entry DOI: 10.7270/Q2K938W3