BDBM50429508 CHEMBL2332842
SMILES: Brc1ccc(NC(=O)Nc2ccc(Nc3ncnc4n[nH]cc34)cc2)cc1
InChI Key: InChIKey=JWEDGONIPHOTHT-UHFFFAOYSA-N
Data: 1 IC50
Activity Spreadsheet -- Enzyme Inhibition Constant Data from BindingDB
Found 1 hit for monomerid = 50429508
Trg + Lig
Ki
nM
ΔG°
kcal/mole
IC50
nM
Kd
nM
EC50/IC50
nM
koff
s-1
kon
M-1s-1
pHTemp
°C
Vascular endothelial growth factor receptor 2
(Danio rerio)
BDBM50429508
(CHEMBL2332842)
Show SMILES Brc1ccc(NC(=O)Nc2ccc(Nc3ncnc4n[nH]cc34)cc2)cc1
Show InChI InChI=1S/C18H14BrN7O/c19-11-1-3-13(4-2-11)24-18(27)25-14-7-5-12(6-8-14)23-16-15-9-22-26-17(15)21-10-20-16/h1-10H,(H2,24,25,27)(H2,20,21,22,23,26)
Reactome pathway
n/an/a>1.00E+5n/an/an/an/an/an/a
Sichuan University
Curated by ChEMBL
Assay Description
Inhibition of VEGFR2 in transgenic zebrafish embryo assessed as inhibition of intersegmental vessels formation measured 33 hrs post fertilization by ...
J Med Chem 56: 1641-55 (2013)
Article DOI: 10.1021/jm301537p
BindingDB Entry DOI: 10.7270/Q29S1SC5