null
SMILES: CC(=O)OC[C@]1(C)[C@H](CC[C@@]2(C)[C@H]1C[C@H](OC(=O)c1ccc(cc1)-c1ccccc1)[C@@]1(C)Oc3cc(oc(=O)c3[C@H](O)[C@H]21)-c1cccnc1)OC(C)=O
InChI Key: InChIKey=BMGZOXSRJBBUHW-WMXYXYAOSA-N
Activity Spreadsheet -- Enzyme Inhibition Constant Data from BindingDB
Found 2 hits for monomerid = 50429611
Trg + Lig
Ki
nM
ΔG°
kcal/mole
IC50
nM
Kd
nM
EC50/IC50
nM
koff
s-1
kon
M-1s-1
pHTemp
°C
Sterol O-acyltransferase 1
(Homo sapiens (Human))
BDBM50429611
(CHEMBL2334221)
Show SMILES CC(=O)OC[C@]1(C)[C@H](CC[C@@]2(C)[C@H]1C[C@H](OC(=O)c1ccc(cc1)-c1ccccc1)[C@@]1(C)Oc3cc(oc(=O)c3[C@H](O)[C@H]21)-c1cccnc1)OC(C)=O |r|
Show InChI InChI=1S/C42H43NO10/c1-24(44)49-23-41(4)32-21-34(52-38(47)28-15-13-27(14-16-28)26-10-7-6-8-11-26)42(5)37(40(32,3)18-17-33(41)50-25(2)45)36(46)35-31(53-42)20-30(51-39(35)48)29-12-9-19-43-22-29/h6-16,19-20,22,32-34,36-37,46H,17-18,21,23H2,1-5H3/t32-,33+,34+,36+,37-,40+,41+,42-/m1/s1
n/an/a 700n/an/an/an/an/an/a
Kitasato University
Curated by ChEMBL
Assay Description
Inhibition of ACAT1 (unknown origin) expressed in CHO cells
Bioorg Med Chem Lett 23: 1285-7 (2013)
Article DOI: 10.1016/j.bmcl.2012.12.099
BindingDB Entry DOI: 10.7270/Q2P270HW
Sterol O-acyltransferase 2
(Homo sapiens (Human))
BDBM50429611
(CHEMBL2334221)
Show SMILES CC(=O)OC[C@]1(C)[C@H](CC[C@@]2(C)[C@H]1C[C@H](OC(=O)c1ccc(cc1)-c1ccccc1)[C@@]1(C)Oc3cc(oc(=O)c3[C@H](O)[C@H]21)-c1cccnc1)OC(C)=O |r|
Show InChI InChI=1S/C42H43NO10/c1-24(44)49-23-41(4)32-21-34(52-38(47)28-15-13-27(14-16-28)26-10-7-6-8-11-26)42(5)37(40(32,3)18-17-33(41)50-25(2)45)36(46)35-31(53-42)20-30(51-39(35)48)29-12-9-19-43-22-29/h6-16,19-20,22,32-34,36-37,46H,17-18,21,23H2,1-5H3/t32-,33+,34+,36+,37-,40+,41+,42-/m1/s1
n/an/a 9.5n/an/an/an/an/an/a
Kitasato University
Curated by ChEMBL
Assay Description
Inhibition of ACAT2 (unknown origin) expressed in CHO cells
Bioorg Med Chem Lett 23: 1285-7 (2013)
Article DOI: 10.1016/j.bmcl.2012.12.099
BindingDB Entry DOI: 10.7270/Q2P270HW