BDBM50429874 CHEMBL2332924
SMILES: Cc1cc(ccc1C(=O)N1CCOc2ccc(cc2C1)-c1ccc2nc[nH]c2c1)S(C)(=O)=O
InChI Key: InChIKey=WWDISNGETCKXKD-UHFFFAOYSA-N
Data: 1 IC50
Activity Spreadsheet -- Enzyme Inhibition Constant Data from BindingDB
Found 1 hit for monomerid = 50429874
Trg + Lig
Ki
nM
ΔG°
kcal/mole
IC50
nM
Kd
nM
EC50/IC50
nM
koff
s-1
kon
M-1s-1
pHTemp
°C
Phosphatidylinositol 4,5-bisphosphate 3-kinase catalytic subunit alpha isoform
(Homo sapiens (Human))
BDBM50429874
(CHEMBL2332924)
Show SMILES Cc1cc(ccc1C(=O)N1CCOc2ccc(cc2C1)-c1ccc2nc[nH]c2c1)S(C)(=O)=O
Show InChI InChI=1S/C25H23N3O4S/c1-16-11-20(33(2,30)31)5-6-21(16)25(29)28-9-10-32-24-8-4-17(12-19(24)14-28)18-3-7-22-23(13-18)27-15-26-22/h3-8,11-13,15H,9-10,14H2,1-2H3,(H,26,27)
NCI pathway
Reactome pathway
n/an/a>3.00E+3n/an/an/an/an/an/a
Exelixis
Curated by ChEMBL
Assay Description
Inhibition of PI3Kalpha (unknown origin) using PIP2 as substrate after 2 hrs by luminescence assay
J Med Chem 56: 2218-34 (2013)
Article DOI: 10.1021/jm3007933
BindingDB Entry DOI: 10.7270/Q2ZC847X