BDBM50429879 CHEMBL2332923
SMILES: CCS(=O)(=O)c1ccc(cc1)C(=O)N1CCOc2ccc(cc2C1)-c1ccc2nc[nH]c2c1
InChI Key: InChIKey=PTMBZMCLDGMBFT-UHFFFAOYSA-N
Data: 1 IC50
Activity Spreadsheet -- Enzyme Inhibition Constant Data from BindingDB
Found 1 hit for monomerid = 50429879
Trg + Lig
Ki
nM
ΔG°
kcal/mole
IC50
nM
Kd
nM
EC50/IC50
nM
koff
s-1
kon
M-1s-1
pHTemp
°C
Phosphatidylinositol 4,5-bisphosphate 3-kinase catalytic subunit alpha isoform
(Homo sapiens (Human))
BDBM50429879
(CHEMBL2332923)
Show SMILES CCS(=O)(=O)c1ccc(cc1)C(=O)N1CCOc2ccc(cc2C1)-c1ccc2nc[nH]c2c1
Show InChI InChI=1S/C25H23N3O4S/c1-2-33(30,31)21-7-3-17(4-8-21)25(29)28-11-12-32-24-10-6-18(13-20(24)15-28)19-5-9-22-23(14-19)27-16-26-22/h3-10,13-14,16H,2,11-12,15H2,1H3,(H,26,27)
NCI pathway
Reactome pathway
n/an/a 2.17E+3n/an/an/an/an/an/a
Exelixis
Curated by ChEMBL
Assay Description
Inhibition of PI3Kalpha (unknown origin) using PIP2 as substrate after 2 hrs by luminescence assay
J Med Chem 56: 2218-34 (2013)
Article DOI: 10.1021/jm3007933
BindingDB Entry DOI: 10.7270/Q2ZC847X