BDBM50429883 CHEMBL2332919
SMILES: FC(F)(F)c1ccc(cc1)C(=O)N1CCOc2ccc(cc2C1)-c1ccc2nc[nH]c2c1
InChI Key: InChIKey=CXWNDVAYTGMYND-UHFFFAOYSA-N
Data: 1 IC50
Activity Spreadsheet -- Enzyme Inhibition Constant Data from BindingDB
Found 1 hit for monomerid = 50429883
Trg + Lig
Ki
nM
ΔG°
kcal/mole
IC50
nM
Kd
nM
EC50/IC50
nM
koff
s-1
kon
M-1s-1
pHTemp
°C
Phosphatidylinositol 4,5-bisphosphate 3-kinase catalytic subunit alpha isoform
(Homo sapiens (Human))
BDBM50429883
(CHEMBL2332919)
Show SMILES FC(F)(F)c1ccc(cc1)C(=O)N1CCOc2ccc(cc2C1)-c1ccc2nc[nH]c2c1
Show InChI InChI=1S/C24H18F3N3O2/c25-24(26,27)19-5-1-15(2-6-19)23(31)30-9-10-32-22-8-4-16(11-18(22)13-30)17-3-7-20-21(12-17)29-14-28-20/h1-8,11-12,14H,9-10,13H2,(H,28,29)
NCI pathway
Reactome pathway
n/an/a 1.09E+3n/an/an/an/an/an/a
Exelixis
Curated by ChEMBL
Assay Description
Inhibition of PI3Kalpha (unknown origin) using PIP2 as substrate after 2 hrs by luminescence assay
J Med Chem 56: 2218-34 (2013)
Article DOI: 10.1021/jm3007933
BindingDB Entry DOI: 10.7270/Q2ZC847X