BDBM50429896 CHEMBL2332918
SMILES: Cc1nc2ccc(cc2[nH]1)-c1ccc2OCCN(Cc2c1)C(=O)c1ccc(cc1)C(=O)C(F)(F)F
InChI Key: InChIKey=IXENPKUVLGSVDO-UHFFFAOYSA-N
Data: 1 IC50
Activity Spreadsheet -- Enzyme Inhibition Constant Data from BindingDB
Found 1 hit for monomerid = 50429896
Trg + Lig
Ki
nM
ΔG°
kcal/mole
IC50
nM
Kd
nM
EC50/IC50
nM
koff
s-1
kon
M-1s-1
pHTemp
°C
Phosphatidylinositol 4,5-bisphosphate 3-kinase catalytic subunit alpha isoform
(Homo sapiens (Human))
BDBM50429896
(CHEMBL2332918)
Show SMILES Cc1nc2ccc(cc2[nH]1)-c1ccc2OCCN(Cc2c1)C(=O)c1ccc(cc1)C(=O)C(F)(F)F
Show InChI InChI=1S/C26H20F3N3O3/c1-15-30-21-8-6-19(13-22(21)31-15)18-7-9-23-20(12-18)14-32(10-11-35-23)25(34)17-4-2-16(3-5-17)24(33)26(27,28)29/h2-9,12-13H,10-11,14H2,1H3,(H,30,31)
NCI pathway
Reactome pathway
n/an/a 89n/an/an/an/an/an/a
Exelixis
Curated by ChEMBL
Assay Description
Inhibition of PI3Kalpha (unknown origin) using PIP2 as substrate after 2 hrs by luminescence assay
J Med Chem 56: 2218-34 (2013)
Article DOI: 10.1021/jm3007933
BindingDB Entry DOI: 10.7270/Q2ZC847X