BDBM50430064 CHEMBL2336413
SMILES: Clc1cc2[nH]c(=O)oc2cc1C[C@@H](NC(=O)N1CCC(CC1)N1Cc2ccccc2NC1=O)C(=O)N1CCC(CC1)N1CCCCC1
InChI Key: InChIKey=RUIONSFUCOPZLD-GDLZYMKVSA-N
Data: 1 KI  2 IC50
Activity Spreadsheet -- Enzyme Inhibition Constant Data from BindingDB
Found 3 hits for monomerid = 50430064
Trg + Lig
Ki
nM
ΔG°
kcal/mole
IC50
nM
Kd
nM
EC50/IC50
nM
koff
s-1
kon
M-1s-1
pHTemp
°C
Calcitonin gene-related peptide type 1 receptor
(Homo sapiens (Human))
BDBM50430064
(CHEMBL2336413)
Show SMILES Clc1cc2[nH]c(=O)oc2cc1C[C@@H](NC(=O)N1CCC(CC1)N1Cc2ccccc2NC1=O)C(=O)N1CCC(CC1)N1CCCCC1 |r|
Show InChI InChI=1S/C34H42ClN7O5/c35-26-20-28-30(47-34(46)38-28)19-23(26)18-29(31(43)40-14-8-24(9-15-40)39-12-4-1-5-13-39)37-32(44)41-16-10-25(11-17-41)42-21-22-6-2-3-7-27(22)36-33(42)45/h2-3,6-7,19-20,24-25,29H,1,4-5,8-18,21H2,(H,36,45)(H,37,44)(H,38,46)/t29-/m1/s1
Reactome pathway
0.280n/an/an/an/an/an/an/an/a
Bristol-Myers Squibb Research& Development
Curated by ChEMBL
Assay Description
Binding affinity to CGRP receptor (unknown origin)
Bioorg Med Chem Lett 23: 1870-3 (2013)
Article DOI: 10.1016/j.bmcl.2013.01.011
BindingDB Entry DOI: 10.7270/Q2WD41XV
Cytochrome P450 3A4
(Homo sapiens (Human))
BDBM50430064
(CHEMBL2336413)
Show SMILES Clc1cc2[nH]c(=O)oc2cc1C[C@@H](NC(=O)N1CCC(CC1)N1Cc2ccccc2NC1=O)C(=O)N1CCC(CC1)N1CCCCC1 |r|
Show InChI InChI=1S/C34H42ClN7O5/c35-26-20-28-30(47-34(46)38-28)19-23(26)18-29(31(43)40-14-8-24(9-15-40)39-12-4-1-5-13-39)37-32(44)41-16-10-25(11-17-41)42-21-22-6-2-3-7-27(22)36-33(42)45/h2-3,6-7,19-20,24-25,29H,1,4-5,8-18,21H2,(H,36,45)(H,37,44)(H,38,46)/t29-/m1/s1
Reactome pathway
n/an/a>4.00E+4n/an/an/an/an/an/a
Bristol-Myers Squibb Research& Development
Curated by ChEMBL
Assay Description
Inhibition of CYP3A4 (unknown origin) using 7-benzyloxy-4-trifluoromethylcoumarin as substrate
Bioorg Med Chem Lett 23: 1870-3 (2013)
Article DOI: 10.1016/j.bmcl.2013.01.011
BindingDB Entry DOI: 10.7270/Q2WD41XV
Cytochrome P450 3A4
(Homo sapiens (Human))
BDBM50430064
(CHEMBL2336413)
Show SMILES Clc1cc2[nH]c(=O)oc2cc1C[C@@H](NC(=O)N1CCC(CC1)N1Cc2ccccc2NC1=O)C(=O)N1CCC(CC1)N1CCCCC1 |r|
Show InChI InChI=1S/C34H42ClN7O5/c35-26-20-28-30(47-34(46)38-28)19-23(26)18-29(31(43)40-14-8-24(9-15-40)39-12-4-1-5-13-39)37-32(44)41-16-10-25(11-17-41)42-21-22-6-2-3-7-27(22)36-33(42)45/h2-3,6-7,19-20,24-25,29H,1,4-5,8-18,21H2,(H,36,45)(H,37,44)(H,38,46)/t29-/m1/s1
Reactome pathway
n/an/a 5.00E+3n/an/an/an/an/an/a
Bristol-Myers Squibb Research& Development
Curated by ChEMBL
Assay Description
Inhibition of CYP3A4 (unknown origin) using 7-benzyloxy-resorufin as substrate
Bioorg Med Chem Lett 23: 1870-3 (2013)
Article DOI: 10.1016/j.bmcl.2013.01.011
BindingDB Entry DOI: 10.7270/Q2WD41XV