null
SMILES: Oc1ccc(Br)cc1C(=O)Nc1cc(cc(c1)C(F)(F)F)C(F)(F)F
InChI Key: InChIKey=RHNWUOJJYHDFQF-UHFFFAOYSA-N
Activity Spreadsheet -- Enzyme Inhibition Constant Data from BindingDB
Found 1 hit for monomerid = 50430158
Trg + Lig
Ki
nM
ΔG°
kcal/mole
IC50
nM
Kd
nM
EC50/IC50
nM
koff
s-1
kon
M-1s-1
pHTemp
°C
Transmembrane protease serine 4
(Homo sapiens (Human))
BDBM50430158
(CHEMBL2313117)
Show SMILES Oc1ccc(Br)cc1C(=O)Nc1cc(cc(c1)C(F)(F)F)C(F)(F)F
Show InChI InChI=1S/C15H8BrF6NO2/c16-9-1-2-12(24)11(6-9)13(25)23-10-4-7(14(17,18)19)3-8(5-10)15(20,21)22/h1-6,24H,(H,23,25)
n/an/a 1.30E+4n/an/an/an/an/an/a
Korea Research Institute of Bioscience and Biotechnology
Curated by ChEMBL
Assay Description
Inhibition of N-terminal His6-tagged recombinant TMPRSS4 (unknown origin) fused with enterokinase cleavage sequence DYKDDDGDYKDDDDK expressed in Esch...
Bioorg Med Chem Lett 23: 1748-51 (2013)
Article DOI: 10.1016/j.bmcl.2013.01.055
BindingDB Entry DOI: 10.7270/Q2057H8S