BDBM50430335 CHEMBL2334286
SMILES: N[C@@H](Cc1ccccc1)c1nc2ccc(cc2c(=O)[nH]1)-c1cn[nH]c1
InChI Key: InChIKey=KCFBWNCNVLHUFR-INIZCTEOSA-N
Data: 1 IC50
Activity Spreadsheet -- Enzyme Inhibition Constant Data from BindingDB
Found 1 hit for monomerid = 50430335
Trg + Lig
Ki
nM
ΔG°
kcal/mole
IC50
nM
Kd
nM
EC50/IC50
nM
koff
s-1
kon
M-1s-1
pHTemp
°C
Rho-associated protein kinase 2
(Homo sapiens (Human))
BDBM50430335
(CHEMBL2334286)
Show SMILES N[C@@H](Cc1ccccc1)c1nc2ccc(cc2c(=O)[nH]1)-c1cn[nH]c1 |r|
Show InChI InChI=1S/C19H17N5O/c20-16(8-12-4-2-1-3-5-12)18-23-17-7-6-13(14-10-21-22-11-14)9-15(17)19(25)24-18/h1-7,9-11,16H,8,20H2,(H,21,22)(H,23,24,25)/t16-/m0/s1
n/an/a 12n/an/an/an/an/an/a
Translational Research Institute
Curated by ChEMBL
Assay Description
Inhibition of human recombinant 6-His-tagged ROCK2 expressed in baculovirus-infected Sf9 cells using LCB-AKRRRLSSLRA-NH2 as substrate after 25 mins b...
Bioorg Med Chem Lett 23: 1592-9 (2013)
Article DOI: 10.1016/j.bmcl.2013.01.109
BindingDB Entry DOI: 10.7270/Q2TD9ZQM