null
SMILES: CN(CCCO)c1nc(nc2ccc(cc12)-c1cn[nH]c1)[C@H](N)Cc1cccc(F)c1
InChI Key: InChIKey=ABAXGKKDZNTTAD-HXUWFJFHSA-N
Activity Spreadsheet -- Enzyme Inhibition Constant Data from BindingDB
Found 1 hit for monomerid = 50430342
Trg + Lig
Ki
nM
ΔG°
kcal/mole
IC50
nM
Kd
nM
EC50/IC50
nM
koff
s-1
kon
M-1s-1
pHTemp
°C
Rho-associated protein kinase 2
(Homo sapiens (Human))
BDBM50430342
(CHEMBL2333890)
Show SMILES CN(CCCO)c1nc(nc2ccc(cc12)-c1cn[nH]c1)[C@H](N)Cc1cccc(F)c1 |r|
Show InChI InChI=1S/C23H25FN6O/c1-30(8-3-9-31)23-19-12-16(17-13-26-27-14-17)6-7-21(19)28-22(29-23)20(25)11-15-4-2-5-18(24)10-15/h2,4-7,10,12-14,20,31H,3,8-9,11,25H2,1H3,(H,26,27)/t20-/m1/s1
n/an/a 159n/an/an/an/an/an/a
Translational Research Institute
Curated by ChEMBL
Assay Description
Inhibition of human recombinant 6-His-tagged ROCK2 expressed in baculovirus-infected Sf9 cells using LCB-AKRRRLSSLRA-NH2 as substrate after 25 mins b...
Bioorg Med Chem Lett 23: 1592-9 (2013)
Article DOI: 10.1016/j.bmcl.2013.01.109
BindingDB Entry DOI: 10.7270/Q2TD9ZQM