null
SMILES: CN(CCO)c1nc(nc2ccc(cc12)-c1cn[nH]c1)[C@H](N)Cc1cccc(F)c1
InChI Key: InChIKey=KNXAAUXJYZDYLN-LJQANCHMSA-N
Activity Spreadsheet -- Enzyme Inhibition Constant Data from BindingDB
Found 1 hit for monomerid = 50430343
Trg + Lig
Ki
nM
ΔG°
kcal/mole
IC50
nM
Kd
nM
EC50/IC50
nM
koff
s-1
kon
M-1s-1
pHTemp
°C
Rho-associated protein kinase 2
(Homo sapiens (Human))
BDBM50430343
(CHEMBL2333889)
Show SMILES CN(CCO)c1nc(nc2ccc(cc12)-c1cn[nH]c1)[C@H](N)Cc1cccc(F)c1 |r|
Show InChI InChI=1S/C22H23FN6O/c1-29(7-8-30)22-18-11-15(16-12-25-26-13-16)5-6-20(18)27-21(28-22)19(24)10-14-3-2-4-17(23)9-14/h2-6,9,11-13,19,30H,7-8,10,24H2,1H3,(H,25,26)/t19-/m1/s1
n/an/a 27n/an/an/an/an/an/a
Translational Research Institute
Curated by ChEMBL
Assay Description
Inhibition of human recombinant 6-His-tagged ROCK2 expressed in baculovirus-infected Sf9 cells using LCB-AKRRRLSSLRA-NH2 as substrate after 25 mins b...
Bioorg Med Chem Lett 23: 1592-9 (2013)
Article DOI: 10.1016/j.bmcl.2013.01.109
BindingDB Entry DOI: 10.7270/Q2TD9ZQM