null
SMILES: COc1cc(cc2c1nc([nH]c2=O)[C@@H](N)Cc1cccc(F)c1)-c1cn[nH]c1
InChI Key: InChIKey=RVYJKUWZLONOCK-INIZCTEOSA-N
Activity Spreadsheet -- Enzyme Inhibition Constant Data from BindingDB
Found 1 hit for monomerid = 50430369
Trg + Lig
Ki
nM
ΔG°
kcal/mole
IC50
nM
Kd
nM
EC50/IC50
nM
koff
s-1
kon
M-1s-1
pHTemp
°C
Rho-associated protein kinase 2
(Homo sapiens (Human))
BDBM50430369
(CHEMBL2333907)
Show SMILES COc1cc(cc2c1nc([nH]c2=O)[C@@H](N)Cc1cccc(F)c1)-c1cn[nH]c1 |r|
Show InChI InChI=1S/C20H18FN5O2/c1-28-17-8-12(13-9-23-24-10-13)7-15-18(17)25-19(26-20(15)27)16(22)6-11-3-2-4-14(21)5-11/h2-5,7-10,16H,6,22H2,1H3,(H,23,24)(H,25,26,27)/t16-/m0/s1
n/an/a 8n/an/an/an/an/an/a
Translational Research Institute
Curated by ChEMBL
Assay Description
Inhibition of human recombinant 6-His-tagged ROCK2 expressed in baculovirus-infected Sf9 cells using LCB-AKRRRLSSLRA-NH2 as substrate after 25 mins b...
Bioorg Med Chem Lett 23: 1592-9 (2013)
Article DOI: 10.1016/j.bmcl.2013.01.109
BindingDB Entry DOI: 10.7270/Q2TD9ZQM