BDBM50430550 CHEMBL2336906
SMILES: Cc1cc(ccc1S(N)(=O)=O)-c1nnc(Nc2ccc(cc2)S(N)(=O)=O)c2ccccc12
InChI Key: InChIKey=VGWGODQLJSCOSQ-UHFFFAOYSA-N
Data: 3 IC50
Activity Spreadsheet -- Enzyme Inhibition Constant Data from BindingDB
Found 3 hits for monomerid = 50430550
Trg + Lig
Ki
nM
ΔG°
kcal/mole
IC50
nM
Kd
nM
EC50/IC50
nM
koff
s-1
kon
M-1s-1
pHTemp
°C
Carbonic anhydrase 1
(Homo sapiens (Human))
BDBM50430550
(CHEMBL2336906)
Show SMILES Cc1cc(ccc1S(N)(=O)=O)-c1nnc(Nc2ccc(cc2)S(N)(=O)=O)c2ccccc12
Show InChI InChI=1S/C21H19N5O4S2/c1-13-12-14(6-11-19(13)32(23,29)30)20-17-4-2-3-5-18(17)21(26-25-20)24-15-7-9-16(10-8-15)31(22,27)28/h2-12H,1H3,(H,24,26)(H2,22,27,28)(H2,23,29,30)
NCI pathway
Reactome pathway
n/an/a 86n/an/an/an/an/an/a
East China University of Science and Technology
Curated by ChEMBL
Assay Description
Inhibition of recombinant human carbonic anhydrase 1 after 15 mins by stopped flow CO2 hydration assay
Eur J Med Chem 62: 597-604 (2013)
Article DOI: 10.1016/j.ejmech.2013.01.030
BindingDB Entry DOI: 10.7270/Q2X92CNX
Carbonic anhydrase 2
(Homo sapiens (Human))
BDBM50430550
(CHEMBL2336906)
Show SMILES Cc1cc(ccc1S(N)(=O)=O)-c1nnc(Nc2ccc(cc2)S(N)(=O)=O)c2ccccc12
Show InChI InChI=1S/C21H19N5O4S2/c1-13-12-14(6-11-19(13)32(23,29)30)20-17-4-2-3-5-18(17)21(26-25-20)24-15-7-9-16(10-8-15)31(22,27)28/h2-12H,1H3,(H,24,26)(H2,22,27,28)(H2,23,29,30)
Reactome pathway
n/an/a 27n/an/an/an/an/an/a
East China University of Science and Technology
Curated by ChEMBL
Assay Description
Inhibition of recombinant human carbonic anhydrase 2 after 15 mins by stopped flow CO2 hydration assay
Eur J Med Chem 62: 597-604 (2013)
Article DOI: 10.1016/j.ejmech.2013.01.030
BindingDB Entry DOI: 10.7270/Q2X92CNX
Carbonic anhydrase 9
(Homo sapiens (Human))
BDBM50430550
(CHEMBL2336906)
Show SMILES Cc1cc(ccc1S(N)(=O)=O)-c1nnc(Nc2ccc(cc2)S(N)(=O)=O)c2ccccc12
Show InChI InChI=1S/C21H19N5O4S2/c1-13-12-14(6-11-19(13)32(23,29)30)20-17-4-2-3-5-18(17)21(26-25-20)24-15-7-9-16(10-8-15)31(22,27)28/h2-12H,1H3,(H,24,26)(H2,22,27,28)(H2,23,29,30)
NCI pathway
Reactome pathway
n/an/a 3.30n/an/an/an/an/an/a
East China University of Science and Technology
Curated by ChEMBL
Assay Description
Inhibition of recombinant human carbonic anhydrase 9 after 15 mins by stopped flow CO2 hydration assay
Eur J Med Chem 62: 597-604 (2013)
Article DOI: 10.1016/j.ejmech.2013.01.030
BindingDB Entry DOI: 10.7270/Q2X92CNX