BDBM50430787 CHEMBL2334764
SMILES: CCNC(=O)Nc1ccc(cc1)-c1nc2[C@H]3CC[C@@H](Cc2c(n1)N1CCOC[C@@H]1C)N3S(C)(=O)=O
InChI Key: InChIKey=VQCWJZWGHDLXCC-ZAAXVRCTSA-N
Data: 1 KI  1 IC50
Activity Spreadsheet -- Enzyme Inhibition Constant Data from BindingDB
Found 2 hits for monomerid = 50430787
Trg + Lig
Ki
nM
ΔG°
kcal/mole
IC50
nM
Kd
nM
EC50/IC50
nM
koff
s-1
kon
M-1s-1
pHTemp
°C
Serine/threonine-protein kinase mTOR
(Homo sapiens (Human))
BDBM50430787
(CHEMBL2334764)
Show SMILES CCNC(=O)Nc1ccc(cc1)-c1nc2[C@H]3CC[C@@H](Cc2c(n1)N1CCOC[C@@H]1C)N3S(C)(=O)=O |r,THB:31:30:19.14.20:17.16|
Show InChI InChI=1S/C24H32N6O4S/c1-4-25-24(31)26-17-7-5-16(6-8-17)22-27-21-19(23(28-22)29-11-12-34-14-15(29)2)13-18-9-10-20(21)30(18)35(3,32)33/h5-8,15,18,20H,4,9-14H2,1-3H3,(H2,25,26,31)/t15-,18-,20+/m0/s1
NCI pathway
Reactome pathway
0.990n/an/an/an/an/an/an/an/a
Genentech
Curated by ChEMBL
Assay Description
Inhibition of human recombinant mTOR expressed in insect cells assessed as inhibition of phosphorylation of (GFP)-4-EBP1 protein after 30 mins by flu...
J Med Chem 56: 3090-101 (2013)
Article DOI: 10.1021/jm400194n
BindingDB Entry DOI: 10.7270/Q2QJ7JNF
Cytochrome P450 3A4
(Homo sapiens (Human))
BDBM50430787
(CHEMBL2334764)
Show SMILES CCNC(=O)Nc1ccc(cc1)-c1nc2[C@H]3CC[C@@H](Cc2c(n1)N1CCOC[C@@H]1C)N3S(C)(=O)=O |r,THB:31:30:19.14.20:17.16|
Show InChI InChI=1S/C24H32N6O4S/c1-4-25-24(31)26-17-7-5-16(6-8-17)22-27-21-19(23(28-22)29-11-12-34-14-15(29)2)13-18-9-10-20(21)30(18)35(3,32)33/h5-8,15,18,20H,4,9-14H2,1-3H3,(H2,25,26,31)/t15-,18-,20+/m0/s1
Reactome pathway
n/an/a 5.00E+3n/an/an/an/an/an/a
Genentech
Curated by ChEMBL
Assay Description
Time dependent inhibition of human CYP3A4 preincubated for 30 mins in presence of NADPH
J Med Chem 56: 3090-101 (2013)
Article DOI: 10.1021/jm400194n
BindingDB Entry DOI: 10.7270/Q2QJ7JNF