BDBM50430848 CHEMBL2336008
SMILES: CN1CCN(Cc2cc(NC(=O)c3ccc(C)c(c3)C#Cc3cnc4ccnn4c3)cc(c2)C(F)(F)F)CC1
InChI Key: InChIKey=MXYXKUBTRKHYAM-UHFFFAOYSA-N
Data: 3 IC50
Activity Spreadsheet -- Enzyme Inhibition Constant Data from BindingDB
Found 3 hits for monomerid = 50430848
Trg + Lig
Ki
nM
ΔG°
kcal/mole
IC50
nM
Kd
nM
EC50/IC50
nM
koff
s-1
kon
M-1s-1
pHTemp
°C
Mast/stem cell growth factor receptor Kit
(Homo sapiens (Human))
BDBM50430848
(CHEMBL2336008)
Show SMILES CN1CCN(Cc2cc(NC(=O)c3ccc(C)c(c3)C#Cc3cnc4ccnn4c3)cc(c2)C(F)(F)F)CC1
Show InChI InChI=1S/C29H27F3N6O/c1-20-3-5-24(15-23(20)6-4-21-17-33-27-7-8-34-38(27)19-21)28(39)35-26-14-22(13-25(16-26)29(30,31)32)18-37-11-9-36(2)10-12-37/h3,5,7-8,13-17,19H,9-12,18H2,1-2H3,(H,35,39)
n/an/a 756n/an/an/an/an/an/a
Chinese Academy of Sciences
Curated by ChEMBL
Assay Description
Inhibition of c-KIT (unknown origin) using Ser/Thr 6 peptide as substrate incubated for 1 hr prior to substrate addition measured after 2 hrs by FRET...
J Med Chem 56: 3281-95 (2013)
Article DOI: 10.1021/jm301824k
BindingDB Entry DOI: 10.7270/Q22V2HHJ
Discoidin domain-containing receptor 2
(Homo sapiens (Human))
BDBM50430848
(CHEMBL2336008)
Show SMILES CN1CCN(Cc2cc(NC(=O)c3ccc(C)c(c3)C#Cc3cnc4ccnn4c3)cc(c2)C(F)(F)F)CC1
Show InChI InChI=1S/C29H27F3N6O/c1-20-3-5-24(15-23(20)6-4-21-17-33-27-7-8-34-38(27)19-21)28(39)35-26-14-22(13-25(16-26)29(30,31)32)18-37-11-9-36(2)10-12-37/h3,5,7-8,13-17,19H,9-12,18H2,1-2H3,(H,35,39)
Reactome pathway
n/an/a 101n/an/an/an/an/an/a
Chinese Academy of Sciences
Curated by ChEMBL
Assay Description
Inhibition of DDR2 (unknown origin) using fluorescein-labeled poly GAT as substrate incubated for 1 hr prior to substrate addition measured after 1 h...
J Med Chem 56: 3281-95 (2013)
Article DOI: 10.1021/jm301824k
BindingDB Entry DOI: 10.7270/Q22V2HHJ
Epithelial discoidin domain-containing receptor 1
(Homo sapiens (Human))
BDBM50430848
(CHEMBL2336008)
Show SMILES CN1CCN(Cc2cc(NC(=O)c3ccc(C)c(c3)C#Cc3cnc4ccnn4c3)cc(c2)C(F)(F)F)CC1
Show InChI InChI=1S/C29H27F3N6O/c1-20-3-5-24(15-23(20)6-4-21-17-33-27-7-8-34-38(27)19-21)28(39)35-26-14-22(13-25(16-26)29(30,31)32)18-37-11-9-36(2)10-12-37/h3,5,7-8,13-17,19H,9-12,18H2,1-2H3,(H,35,39)
n/an/a 8.90n/an/an/an/an/an/a
Chinese Academy of Sciences
Curated by ChEMBL
Assay Description
Inhibition of DDR1 (unknown origin) using fluorescein-labeled poly GAT as substrate incubated for 1 hr prior to substrate addition measured after 1 h...
J Med Chem 56: 3281-95 (2013)
Article DOI: 10.1021/jm301824k
BindingDB Entry DOI: 10.7270/Q22V2HHJ