BDBM50430957 CHEMBL2337404
SMILES: Cc1c(CCOCCCO[N+]([O-])=O)cc(-c2ccc(cc2)S(C)(=O)=O)n1-c1ccccc1
InChI Key: InChIKey=RBILWSWOVJYNHA-UHFFFAOYSA-N
Data: 2 IC50
Activity Spreadsheet -- Enzyme Inhibition Constant Data from BindingDB
Found 2 hits for monomerid = 50430957
Trg + Lig
Ki
nM
ΔG°
kcal/mole
IC50
nM
Kd
nM
EC50/IC50
nM
koff
s-1
kon
M-1s-1
pHTemp
°C
Prostaglandin G/H synthase (cyclooxygenase)
(Mus musculus)
BDBM50430957
(CHEMBL2337404)
Show SMILES Cc1c(CCOCCCO[N+]([O-])=O)cc(-c2ccc(cc2)S(C)(=O)=O)n1-c1ccccc1
Show InChI InChI=1S/C23H26N2O6S/c1-18-20(13-16-30-14-6-15-31-25(26)27)17-23(24(18)21-7-4-3-5-8-21)19-9-11-22(12-10-19)32(2,28)29/h3-5,7-12,17H,6,13-16H2,1-2H3
Reactome pathway
n/an/a>1.00E+4n/an/an/an/an/an/a
Universit£ degli Studi di Siena
Curated by ChEMBL
Assay Description
Inhibition of arachidonic acid-induced COX1 activity in mouse J774 cells assessed as decrease in PGE2 levels incubated for 15 mins prior to arachidon...
J Med Chem 56: 3191-206 (2013)
Article DOI: 10.1021/jm301370e
BindingDB Entry DOI: 10.7270/Q2JS9RSB
Cyclooxygenase-2 (COX-2)
(Mus musculus (Mouse))
BDBM50430957
(CHEMBL2337404)
Show SMILES Cc1c(CCOCCCO[N+]([O-])=O)cc(-c2ccc(cc2)S(C)(=O)=O)n1-c1ccccc1
Show InChI InChI=1S/C23H26N2O6S/c1-18-20(13-16-30-14-6-15-31-25(26)27)17-23(24(18)21-7-4-3-5-8-21)19-9-11-22(12-10-19)32(2,28)29/h3-5,7-12,17H,6,13-16H2,1-2H3
n/an/a 15n/an/an/an/an/an/a
Universit£ degli Studi di Siena
Curated by ChEMBL
Assay Description
Inhibition of Escherichia coli lipopolysaccharide-induced COX2 activity in mouse J774 cells assessed as decrease in PGE2 levels after 24 hrs by RIA
J Med Chem 56: 3191-206 (2013)
Article DOI: 10.1021/jm301370e
BindingDB Entry DOI: 10.7270/Q2JS9RSB