BDBM50430959 CHEMBL2337401
SMILES: Cc1c(CCOCCO[N+]([O-])=O)cc(-c2ccc(cc2)S(C)(=O)=O)n1-c1cccc(F)c1
InChI Key: InChIKey=IPXDLSQHFQLZKA-UHFFFAOYSA-N
Data: 2 IC50
Activity Spreadsheet -- Enzyme Inhibition Constant Data from BindingDB
Found 2 hits for monomerid = 50430959
Trg + Lig
Ki
nM
ΔG°
kcal/mole
IC50
nM
Kd
nM
EC50/IC50
nM
koff
s-1
kon
M-1s-1
pHTemp
°C
Prostaglandin G/H synthase (cyclooxygenase)
(Mus musculus)
BDBM50430959
(CHEMBL2337401)
Show SMILES Cc1c(CCOCCO[N+]([O-])=O)cc(-c2ccc(cc2)S(C)(=O)=O)n1-c1cccc(F)c1
Show InChI InChI=1S/C22H23FN2O6S/c1-16-18(10-11-30-12-13-31-25(26)27)14-22(24(16)20-5-3-4-19(23)15-20)17-6-8-21(9-7-17)32(2,28)29/h3-9,14-15H,10-13H2,1-2H3
Reactome pathway
n/an/a>1.00E+4n/an/an/an/an/an/a
Universit£ degli Studi di Siena
Curated by ChEMBL
Assay Description
Inhibition of arachidonic acid-induced COX1 activity in mouse J774 cells assessed as decrease in PGE2 levels incubated for 15 mins prior to arachidon...
J Med Chem 56: 3191-206 (2013)
Article DOI: 10.1021/jm301370e
BindingDB Entry DOI: 10.7270/Q2JS9RSB
Cyclooxygenase-2 (COX-2)
(Mus musculus (Mouse))
BDBM50430959
(CHEMBL2337401)
Show SMILES Cc1c(CCOCCO[N+]([O-])=O)cc(-c2ccc(cc2)S(C)(=O)=O)n1-c1cccc(F)c1
Show InChI InChI=1S/C22H23FN2O6S/c1-16-18(10-11-30-12-13-31-25(26)27)14-22(24(16)20-5-3-4-19(23)15-20)17-6-8-21(9-7-17)32(2,28)29/h3-9,14-15H,10-13H2,1-2H3
n/an/a 27n/an/an/an/an/an/a
Universit£ degli Studi di Siena
Curated by ChEMBL
Assay Description
Inhibition of Escherichia coli lipopolysaccharide-induced COX2 activity in mouse J774 cells assessed as decrease in PGE2 levels after 24 hrs by RIA
J Med Chem 56: 3191-206 (2013)
Article DOI: 10.1021/jm301370e
BindingDB Entry DOI: 10.7270/Q2JS9RSB