BDBM50430960 CHEMBL2337400
SMILES: Cc1c(CCOCCO[N+]([O-])=O)cc(-c2ccc(cc2)S(C)(=O)=O)n1-c1ccccc1
InChI Key: InChIKey=IIFFGAKIUNZWTM-UHFFFAOYSA-N
Data: 2 IC50
Activity Spreadsheet -- Enzyme Inhibition Constant Data from BindingDB
Found 2 hits for monomerid = 50430960
Trg + Lig
Ki
nM
ΔG°
kcal/mole
IC50
nM
Kd
nM
EC50/IC50
nM
koff
s-1
kon
M-1s-1
pHTemp
°C
Prostaglandin G/H synthase (cyclooxygenase)
(Mus musculus)
BDBM50430960
(CHEMBL2337400)
Show SMILES Cc1c(CCOCCO[N+]([O-])=O)cc(-c2ccc(cc2)S(C)(=O)=O)n1-c1ccccc1
Show InChI InChI=1S/C22H24N2O6S/c1-17-19(12-13-29-14-15-30-24(25)26)16-22(23(17)20-6-4-3-5-7-20)18-8-10-21(11-9-18)31(2,27)28/h3-11,16H,12-15H2,1-2H3
Reactome pathway
n/an/a>1.00E+4n/an/an/an/an/an/a
Universit£ degli Studi di Siena
Curated by ChEMBL
Assay Description
Inhibition of arachidonic acid-induced COX1 activity in mouse J774 cells assessed as decrease in PGE2 levels incubated for 15 mins prior to arachidon...
J Med Chem 56: 3191-206 (2013)
Article DOI: 10.1021/jm301370e
BindingDB Entry DOI: 10.7270/Q2JS9RSB
Cyclooxygenase-2 (COX-2)
(Mus musculus (Mouse))
BDBM50430960
(CHEMBL2337400)
Show SMILES Cc1c(CCOCCO[N+]([O-])=O)cc(-c2ccc(cc2)S(C)(=O)=O)n1-c1ccccc1
Show InChI InChI=1S/C22H24N2O6S/c1-17-19(12-13-29-14-15-30-24(25)26)16-22(23(17)20-6-4-3-5-7-20)18-8-10-21(11-9-18)31(2,27)28/h3-11,16H,12-15H2,1-2H3
n/an/a 17n/an/an/an/an/an/a
Universit£ degli Studi di Siena
Curated by ChEMBL
Assay Description
Inhibition of Escherichia coli lipopolysaccharide-induced COX2 activity in mouse J774 cells assessed as decrease in PGE2 levels after 24 hrs by RIA
J Med Chem 56: 3191-206 (2013)
Article DOI: 10.1021/jm301370e
BindingDB Entry DOI: 10.7270/Q2JS9RSB